program: Orca
programVersion: 5.0.2
elementType: Cl O O O O O N N C C C C C C C C C C C C C C C C C C C H H H H H H H H H H H H H H H H H H H H H H H H H H H
charge: 0
multiplicity: 1
keywords: wb97x-d3
keywords: def2-TZVPP
keywords: def2/J RIJCOSX
keywords: DEFGRID2
keywords: scfconv7
keywords: smallprint printgap noloewdin
keywords: NOSOSCF
formula: C19H27ClN2O5
InChI: InChI=1/C19H27ClN2O5/c1-11(2)17(22-19(25)27-12(3)4)18(24)21-15(10-16(23)26-5)13-6-8-14(20)9-7-13/h6-9,11-12,15,17,21-22H,10H2,1-5H3
54 atoms
Cl -5.406788 1.977158 0.144109
O  -0.002065 -2.672419 -2.070516
O  2.740146 1.853036 -0.625495
O  0.720075 -0.219175 2.384303
O  1.324251 1.318943 -2.300819
O  -1.013402 -0.563288 3.74444
N  0.37519 -1.516732 -0.162067
N  2.537999 -0.26443 -1.22066
C  2.008651 -1.382261 -1.961481
C  3.035496 -2.525299 -2.062582
C  -0.818966 -1.919637 0.536666
C  0.68626 -1.912482 -1.403141
C  3.386395 -3.140314 -0.71139
C  4.284728 -2.063013 -2.802191
C  -0.523522 -2.177777 2.026461
C  -1.961094 -0.930478 0.38689
C  2.134271 1.003304 -1.451941
C  -3.225848 -1.280904 0.855288
C  -1.785286 0.331998 -0.164138
C  -0.323206 -0.91586 2.823022
C  -4.288679 -0.397108 0.783203
C  -2.840647 1.231171 -0.244455
C  2.455645 3.263753 -0.747117
C  -4.084341 0.860122 0.234145
C  3.602601 3.974056 -0.061522
C  1.116834 3.602097 -0.122473
C  1.012479 1.026938 3.017655
H  1.788628 -1.0513 -2.979158
H  2.555955 -3.298366 -2.66836
H  -1.135199 -2.876608 0.117106
H  0.991509 -0.862408 0.295458
H  4.086096 -3.965751 -0.848176
H  2.512672 -3.543763 -0.196928
H  3.870651 -2.429392 -0.037259
H  4.036488 -1.620183 -3.768393
H  4.949459 -2.907416 -2.989099
H  4.851106 -1.323777 -2.232681
H  3.256948 -0.42192 -0.529897
H  -1.358898 -2.721082 2.464136
H  0.361329 -2.813915 2.112838
H  -3.394104 -2.262811 1.281723
H  -0.822632 0.633512 -0.554825
H  -5.263893 -0.688282 1.149792
H  -2.684828 2.209219 -0.679527
H  2.44744 3.531713 -1.806555
H  4.55939 3.726886 -0.522228
H  3.654007 3.722732 0.999148
H  3.466139 5.052494 -0.141262
H  1.091148 3.326573 0.933008
H  0.946546 4.677111 -0.189695
H  0.286997 3.110819 -0.628053
H  1.877659 1.426222 2.496152
H  0.179301 1.723712 2.928774
H  1.260035 0.887695 4.069995
elementType: Cl O N C H
totalener: -1686.36563733 hartree
nucrepener: 2857.62560601 hartree
electener: -4543.99124335 hartree
oneelecener: -7989.83182070 hartree
twoeener: 3445.84057735 hartree
cpcmener: -0.05013208 hartree
kineticenergy: 1680.32382349 hartree
xcener: -138.343712591122 hartree
chargesum: -0.0000000
charge: -0.098687 -0.524302 -0.333063 -0.285514 -0.517439 -0.436350 -0.205947 -0.263158 0.109289 0.063120 0.141675 0.266676 -0.305946 -0.300587 -0.154128 0.022952 0.493727 -0.213045 -0.128219 0.398241 -0.151731 -0.193305 0.164154 0.129927 -0.262059 -0.272265 -0.127505 0.110127 0.051805 0.100967 0.195508 0.102854 0.092419 0.082508 0.097133 0.098451 0.082818 0.180894 0.108049 0.121975 0.140930 0.134266 0.141741 0.138264 0.076463 0.097917 0.090127 0.092053 0.084109 0.108129 0.089807 0.110681 0.121499 0.131999
qa: -0.0987 -0.5243 -0.3331 -0.2855 -0.5174 -0.4364 -0.2059 -0.2632 0.1093 0.0631 0.1417 0.2667 -0.3059 -0.3006 -0.1541 0.0230 0.4937 -0.2130 -0.1282 0.3982 -0.1517 -0.1933 0.1642 0.1299 -0.2621 -0.2723 -0.1275 0.1101 0.0518 0.1010 0.1955 0.1029 0.0924 0.0825 0.0971 0.0985 0.0828 0.1809 0.1080 0.1220 0.1409 0.1343 0.1417 0.1383 0.0765 0.0979 0.0901 0.0921 0.0841 0.1081 0.0898 0.1107 0.1215 0.1320
va: 1.2062 2.0070 2.0705 2.0934 1.9890 2.0645 3.1739 3.1724 3.7920 3.7939 3.7238 4.2426 3.9478 3.9451 3.8720 3.6405 4.3272 4.0241 3.9080 4.1284 3.9934 4.0596 3.8011 3.8071 3.9538 3.9007 3.8520 1.0398 1.0343 1.0355 1.0261 1.0048 1.0119 1.0034 1.0035 1.0046 1.0066 1.0203 1.0228 1.0206 1.0023 0.9941 1.0057 1.0116 1.0203 1.0074 1.0028 1.0055 1.0061 1.0093 1.0179 1.0040 0.9903 0.9951
dispcorr: -0.032749010 hartree
energy: -1686.398386344494
dipole: 43.65254 -40.33354 3.31900 -1.60031 1.87354 0.27323 -1.32969 3.02809 1.69840
magnitude: 3.73831 au
magnitude: 9.50204 debye
