program: Orca
programVersion: 5.0.2
elementType: Cl O O O O O N N C C C C C C C C C C C C C C C C C C C H H H H H H H H H H H H H H H H H H H H H H H H H H H
charge: 0
multiplicity: 1
keywords: wb97x-d3
keywords: def2-TZVPP
keywords: def2/J RIJCOSX
keywords: DEFGRID2
keywords: scfconv7
keywords: smallprint printgap noloewdin
keywords: NOSOSCF
formula: C19H27ClN2O5
InChI: InChI=1/C19H27ClN2O5/c1-11(2)17(22-19(25)27-12(3)4)18(24)21-15(10-16(23)26-5)13-6-8-14(20)9-7-13/h6-9,11-12,15,17,21-22H,10H2,1-5H3
54 atoms
Cl -4.601024 3.305732 0.002324
O  1.210294 -2.601346 -0.762331
O  1.572469 2.479103 -1.706523
O  -0.491626 -4.191337 1.561744
O  0.953992 0.427923 -2.427876
O  0.990949 -3.187361 2.893783
N  0.547229 -0.856823 0.514075
N  2.455598 0.68776 -0.758148
C  2.702734 -0.726989 -0.60365
C  3.773455 -0.946724 0.482297
C  -0.808276 -1.310859 0.761524
C  1.408304 -1.486468 -0.300727
C  5.097363 -0.311714 0.062854
C  3.992411 -2.425765 0.777522
C  -0.943128 -1.967591 2.145224
C  -1.771852 -0.158446 0.59723
C  1.604275 1.148678 -1.69603
C  -2.715937 -0.179875 -0.422594
C  -1.724024 0.951097 1.43734
C  -0.036958 -3.162705 2.261513
C  -3.596054 0.876352 -0.60834
C  -2.590905 2.017807 1.262744
C  0.607105 3.141827 -2.550966
C  -3.522645 1.969827 0.237425
C  1.167099 4.519037 -2.831227
C  -0.738665 3.18415 -1.8541
C  0.321572 -5.361915 1.497418
H  3.080477 -1.15047 -1.540741
H  3.423956 -0.459577 1.400184
H  -1.044907 -2.054871 0.000269
H  0.796082 0.064688 0.843745
H  5.028825 0.761685 -0.11775
H  5.479225 -0.776687 -0.848726
H  5.845359 -0.453016 0.844134
H  3.125326 -2.902162 1.231783
H  4.819453 -2.540836 1.479172
H  4.249687 -2.980136 -0.127218
H  2.969313 1.348466 -0.19515
H  -0.685794 -1.255784 2.929716
H  -1.981305 -2.273502 2.288879
H  -2.769332 -1.031074 -1.090222
H  -1.002912 0.999964 2.245484
H  -4.322131 0.844286 -1.409655
H  -2.537225 2.87483 1.920554
H  0.519907 2.593218 -3.491422
H  2.13486 4.461656 -3.331125
H  1.284119 5.102805 -1.916386
H  0.488206 5.062094 -3.488859
H  -0.676664 3.724175 -0.907593
H  -1.466314 3.696949 -2.484413
H  -1.125741 2.18365 -1.658818
H  0.460207 -5.80898 2.481881
H  -0.212703 -6.061256 0.860199
H  1.295222 -5.149449 1.055651
elementType: Cl O N C H
totalener: -1686.36567200 hartree
nucrepener: 2843.29441563 hartree
electener: -4529.66008763 hartree
oneelecener: -7962.67984280 hartree
twoeener: 3433.01975518 hartree
cpcmener: -0.05187684 hartree
kineticenergy: 1680.30669348 hartree
xcener: -138.337122985000 hartree
chargesum: 0.0000000
charge: -0.100464 -0.502833 -0.334899 -0.272972 -0.518671 -0.453927 -0.154776 -0.244813 0.073303 0.045851 0.226865 0.259209 -0.290860 -0.291829 -0.124685 -0.061263 0.499385 -0.142164 -0.200705 0.400322 -0.158573 -0.193242 0.174088 0.115210 -0.256949 -0.248799 -0.127931 0.106434 0.060277 0.093058 0.167978 0.090437 0.089465 0.095018 0.077376 0.093141 0.093463 0.174021 0.101021 0.115180 0.140838 0.149530 0.140808 0.141460 0.066920 0.096734 0.088274 0.091170 0.088247 0.101042 0.062530 0.119763 0.128421 0.113516
qa: -0.1005 -0.5028 -0.3349 -0.2730 -0.5187 -0.4539 -0.1548 -0.2448 0.0733 0.0459 0.2269 0.2592 -0.2909 -0.2918 -0.1247 -0.0613 0.4994 -0.1422 -0.2007 0.4003 -0.1586 -0.1932 0.1741 0.1152 -0.2569 -0.2488 -0.1279 0.1064 0.0603 0.0931 0.1680 0.0904 0.0895 0.0950 0.0774 0.0931 0.0935 0.1740 0.1010 0.1152 0.1408 0.1495 0.1408 0.1415 0.0669 0.0967 0.0883 0.0912 0.0882 0.1010 0.0625 0.1198 0.1284 0.1135
va: 1.1993 2.0130 2.0899 2.1198 1.9904 2.0426 3.1568 3.1556 3.7915 3.8401 3.6462 4.1927 3.9443 3.9578 3.8695 3.5820 4.3326 3.9391 3.9784 4.1515 3.9788 3.9986 3.8514 3.7704 3.9434 3.8998 3.8771 1.0316 1.0222 1.0657 1.0314 1.0108 1.0019 1.0042 1.0189 1.0063 1.0072 1.0230 1.0302 1.0243 1.0044 1.0016 1.0084 1.0083 1.0236 1.0084 1.0062 1.0051 1.0068 1.0100 1.0267 0.9936 0.9948 0.9902
dispcorr: -0.032674444 hartree
energy: -1686.398346443484
dipole: 31.69908 -31.34084 0.35824 -5.51098 7.23246 1.72148 -2.51397 3.68902 1.17505
magnitude: 2.11484 au
magnitude: 5.37551 debye
