program: Orca
programVersion: 5.0.2
elementType: Cl O O O O O N N C C C C C C C C C C C C C C C C C C C H H H H H H H H H H H H H H H H H H H H H H H H H H H
charge: 0
multiplicity: 1
keywords: wb97x-d3
keywords: def2-TZVPP
keywords: def2/J RIJCOSX
keywords: DEFGRID2
keywords: scfconv7
keywords: smallprint printgap noloewdin
keywords: NOSOSCF
formula: C19H27ClN2O5
InChI: InChI=1/C19H27ClN2O5/c1-11(2)17(22-19(25)27-12(3)4)18(24)21-15(10-16(23)26-5)13-6-8-14(20)9-7-13/h6-9,11-12,15,17,21-22H,10H2,1-5H3
54 atoms
Cl -6.712416 0.627333 -0.950485
O  1.219232 -2.401073 0.528425
O  3.303214 1.800814 -0.026839
O  1.62206 0.203738 2.236195
O  1.451456 1.6008 -1.29546
O  0.484864 -1.25546 3.484446
N  -0.20529 -0.867451 -0.321861
N  2.804514 -0.177247 -0.876292
C  1.920096 -1.181938 -1.435586
C  2.706852 -2.378715 -1.971111
C  -1.145309 -0.876278 0.782378
C  0.938175 -1.569948 -0.324432
C  3.733191 -1.935491 -3.00722
C  1.755179 -3.404477 -2.576895
C  -0.711858 0.089918 1.904319
C  -2.529287 -0.508953 0.303836
C  2.435677 1.117376 -0.767814
C  -2.768802 0.685434 -0.37056
C  -3.605009 -1.3437 0.580544
C  0.510965 -0.402352 2.631908
C  -4.049648 1.037753 -0.765069
C  -4.894792 -1.003584 0.199598
C  3.055863 3.201366 0.218709
C  -5.105744 0.188274 -0.472484
C  3.662585 4.033336 -0.893068
C  3.654646 3.508031 1.574386
C  2.849105 -0.248266 2.809189
H  1.379163 -0.731135 -2.271204
H  3.236839 -2.847241 -1.135043
H  -1.181188 -1.889403 1.185794
H  -0.302534 -0.137972 -1.013113
H  4.262838 -2.800593 -3.409242
H  4.483398 -1.262495 -2.592318
H  3.254643 -1.423878 -3.845894
H  1.032392 -3.789438 -1.856861
H  2.312882 -4.260989 -2.957924
H  1.198425 -2.977322 -3.414306
H  3.557504 -0.505759 -0.287242
H  -0.549668 1.08343 1.48336
H  -1.52095 0.156347 2.633271
H  -1.957218 1.36981 -0.592175
H  -3.442096 -2.275998 1.107305
H  -4.218322 1.969062 -1.288781
H  -5.719926 -1.66525 0.426206
H  1.977625 3.370005 0.258271
H  4.742349 3.885802 -0.954525
H  3.48023 5.091706 -0.703277
H  3.225414 3.795317 -1.863266
H  4.728862 3.316308 1.595551
H  3.499481 4.560581 1.812746
H  3.180327 2.919939 2.361383
H  3.016978 -1.306613 2.608525
H  3.63741 0.33382 2.341764
H  2.873076 -0.077841 3.885801
elementType: Cl O N C H
totalener: -1686.36593146 hartree
nucrepener: 2815.19319870 hartree
electener: -4501.55913016 hartree
oneelecener: -7905.82932877 hartree
twoeener: 3404.27019861 hartree
cpcmener: -0.04347312 hartree
kineticenergy: 1680.30925046 hartree
xcener: -138.335355600267 hartree
chargesum: -0.0000000
charge: -0.096365 -0.513341 -0.330360 -0.262692 -0.534114 -0.452096 -0.168701 -0.217713 0.104800 0.074735 0.231674 0.188587 -0.295593 -0.300052 -0.149126 -0.006819 0.503112 -0.210005 -0.169407 0.377467 -0.178925 -0.153506 0.153886 0.107309 -0.261046 -0.261581 -0.142310 0.102247 0.043956 0.100333 0.185366 0.095372 0.091245 0.085906 0.096004 0.094116 0.089555 0.178251 0.108750 0.119921 0.141019 0.143973 0.143192 0.142985 0.065673 0.088260 0.096342 0.094532 0.092674 0.098665 0.094655 0.125205 0.110501 0.133482
qa: -0.0964 -0.5133 -0.3304 -0.2627 -0.5341 -0.4521 -0.1687 -0.2177 0.1048 0.0747 0.2317 0.1886 -0.2956 -0.3001 -0.1491 -0.0068 0.5031 -0.2100 -0.1694 0.3775 -0.1789 -0.1535 0.1539 0.1073 -0.2610 -0.2616 -0.1423 0.1022 0.0440 0.1003 0.1854 0.0954 0.0912 0.0859 0.0960 0.0941 0.0896 0.1783 0.1087 0.1199 0.1410 0.1440 0.1432 0.1430 0.0657 0.0883 0.0963 0.0945 0.0927 0.0987 0.0947 0.1252 0.1105 0.1335
va: 1.2076 1.9863 2.0877 2.1001 1.9604 2.0522 3.2542 3.1590 3.8023 3.8375 3.7000 4.2512 3.9458 3.9449 3.8751 3.5867 4.3151 4.0141 3.9816 4.1738 4.0306 3.9944 3.8356 3.8248 3.9193 3.9219 3.8427 1.0294 1.0372 1.0509 1.0166 1.0042 1.0126 1.0031 1.0145 1.0034 1.0028 1.0177 1.0217 1.0219 1.0128 1.0031 1.0066 1.0064 1.0232 1.0068 1.0066 1.0158 1.0054 1.0084 1.0065 1.0013 1.0019 0.9971
dispcorr: -0.031945787 hartree
energy: -1686.397877248347
dipole: 47.01589 -45.67096 1.34493 2.88281 -1.39830 1.48451 -4.91342 4.16922 -0.74420
magnitude: 2.13692 au
magnitude: 5.43163 debye
