program: Orca
programVersion: 5.0.2
elementType: Cl O O O O O N N C C C C C C C C C C C C C C C C C C C H H H H H H H H H H H H H H H H H H H H H H H H H H H
charge: 0
multiplicity: 1
keywords: wb97x-d3
keywords: def2-TZVPP
keywords: def2/J RIJCOSX
keywords: DEFGRID2
keywords: scfconv7
keywords: smallprint printgap noloewdin
keywords: NOSOSCF
formula: C19H27ClN2O5
InChI: InChI=1/C19H27ClN2O5/c1-11(2)17(22-19(25)27-12(3)4)18(24)21-15(10-16(23)26-5)13-6-8-14(20)9-7-13/h6-9,11-12,15,17,21-22H,10H2,1-5H3
54 atoms
Cl -5.163826 2.061195 0.297096
O  0.313418 -2.250817 -2.439897
O  2.56268 2.248998 -0.73663
O  -0.989973 -1.209977 3.559522
O  1.142341 1.390514 -2.26947
O  0.861102 -0.599334 2.478941
N  0.604677 -1.424378 -0.356214
N  2.697775 0.102225 -1.248476
C  2.359615 -1.082088 -2.002889
C  3.466501 -2.143849 -1.833795
C  -0.634502 -1.914279 0.194333
C  0.982792 -1.629078 -1.626863
C  3.329396 -3.26782 -2.852634
C  3.569317 -2.710179 -0.421264
C  -0.429153 -2.433924 1.62802
C  -1.751767 -0.890308 0.164343
C  2.058852 1.268901 -1.480665
C  -1.504728 0.477194 0.17705
C  -3.072032 -1.328419 0.190773
C  -0.103219 -1.322762 2.588829
C  -2.54864 1.390959 0.219253
C  -4.126055 -0.430863 0.232849
C  2.035787 3.585387 -0.883134
C  -3.852585 0.928058 0.247642
C  3.098578 4.506764 -0.323794
C  0.712645 3.729764 -0.157658
C  -0.799332 -0.160645 4.51016
H  2.305618 -0.83463 -3.066827
H  4.399027 -1.614252 -2.056479
H  -0.943413 -2.774387 -0.401657
H  1.212914 -0.889313 0.246421
H  4.212681 -3.906426 -2.822121
H  3.236936 -2.883091 -3.869432
H  2.464634 -3.901038 -2.653191
H  2.721987 -3.354153 -0.181184
H  3.628798 -1.939324 0.349091
H  4.470598 -3.317563 -0.331453
H  3.522447 0.103214 -0.667003
H  -1.327803 -2.962925 1.941676
H  0.395883 -3.150752 1.633676
H  -0.491826 0.855553 0.157891
H  -3.288426 -2.390201 0.17644
H  -2.337846 2.452173 0.228374
H  -5.145979 -0.789663 0.249657
H  1.898727 3.796167 -1.946565
H  2.783476 5.5436 -0.440236
H  4.047459 4.388486 -0.847818
H  3.266286 4.326563 0.739318
H  -0.067578 3.110859 -0.598121
H  0.810031 3.472427 0.898288
H  0.377403 4.765991 -0.217891
H  0.14647 -0.26764 5.041102
H  -0.840126 0.818306 4.032209
H  -1.618847 -0.24764 5.217773
elementType: Cl O N C H
totalener: -1686.36512867 hartree
nucrepener: 2849.20411121 hartree
electener: -4535.56923988 hartree
oneelecener: -7974.64506117 hartree
twoeener: 3439.07582128 hartree
cpcmener: -0.04867145 hartree
kineticenergy: 1680.32862103 hartree
xcener: -138.343994578622 hartree
chargesum: 0.0000000
charge: -0.097874 -0.514367 -0.332761 -0.270575 -0.517334 -0.469260 -0.191482 -0.237370 0.107094 0.064547 0.110761 0.250829 -0.314111 -0.311483 -0.134604 0.045727 0.486794 -0.175496 -0.200769 0.412562 -0.173237 -0.157720 0.169089 0.111725 -0.257277 -0.273983 -0.123204 0.111816 0.058640 0.095542 0.188190 0.097760 0.097791 0.084351 0.085030 0.093027 0.108256 0.172082 0.107510 0.120606 0.167542 0.141735 0.135426 0.140563 0.067205 0.090879 0.096484 0.088931 0.082383 0.092591 0.106155 0.116982 0.116844 0.129460
qa: -0.0979 -0.5144 -0.3328 -0.2706 -0.5173 -0.4693 -0.1915 -0.2374 0.1071 0.0645 0.1108 0.2508 -0.3141 -0.3115 -0.1346 0.0457 0.4868 -0.1755 -0.2008 0.4126 -0.1732 -0.1577 0.1691 0.1117 -0.2573 -0.2740 -0.1232 0.1118 0.0586 0.0955 0.1882 0.0978 0.0978 0.0844 0.0850 0.0930 0.1083 0.1721 0.1075 0.1206 0.1675 0.1417 0.1354 0.1406 0.0672 0.0909 0.0965 0.0889 0.0824 0.0926 0.1062 0.1170 0.1168 0.1295
va: 1.2083 2.0141 2.0844 2.1386 1.9890 2.0161 3.1586 3.1658 3.8209 3.8363 3.8321 4.1786 3.9521 3.9470 3.9104 3.6157 4.3379 3.9679 4.0064 4.0970 4.0451 3.9970 3.8424 3.8525 3.9454 3.8748 3.8625 1.0368 1.0157 1.0414 1.0288 1.0020 1.0035 1.0113 1.0059 1.0104 1.0056 1.0233 1.0266 1.0127 0.9701 1.0025 1.0148 1.0067 1.0189 1.0056 1.0080 1.0060 1.0240 1.0067 1.0077 0.9942 0.9928 0.9944
dispcorr: -0.031967309 hartree
energy: -1686.397095979437
dipole: 35.66403 -33.84944 1.81459 -4.57684 4.38249 -0.19435 1.49846 1.39304 2.89151
magnitude: 3.41926 au
magnitude: 8.69106 debye
