program: Orca
programVersion: 5.0.2
elementType: Cl O O O O O N N C C C C C C C C C C C C C C C C C C C H H H H H H H H H H H H H H H H H H H H H H H H H H H
charge: 0
multiplicity: 1
keywords: wb97x-d3
keywords: def2-TZVPP
keywords: def2/J RIJCOSX
keywords: DEFGRID2
keywords: scfconv7
keywords: smallprint printgap noloewdin
keywords: NOSOSCF
formula: C19H27ClN2O5
InChI: InChI=1/C19H27ClN2O5/c1-11(2)17(22-19(25)27-12(3)4)18(24)21-15(10-16(23)26-5)13-6-8-14(20)9-7-13/h6-9,11-12,15,17,21-22H,10H2,1-5H3
54 atoms
Cl -5.152748 2.105628 0.513153
O  0.378431 -2.295504 -2.474567
O  2.550888 2.244341 -0.739382
O  -0.988939 -1.2375 3.475795
O  1.254625 1.406488 -2.390195
O  0.895462 -0.650699 2.440441
N  0.580437 -1.370595 -0.420573
N  2.718393 0.102729 -1.258962
C  2.399701 -1.090642 -2.005727
C  3.49678 -2.153779 -1.784418
C  -0.648115 -1.881844 0.132121
C  1.011263 -1.634514 -1.663729
C  3.422816 -3.265214 -2.822401
C  3.513025 -2.736533 -0.37438
C  -0.409165 -2.452701 1.543097
C  -1.763075 -0.855213 0.170829
C  2.105377 1.273563 -1.53243
C  -1.517324 0.510978 0.121566
C  -3.076503 -1.290126 0.328519
C  -0.082148 -1.359518 2.523707
C  -2.554239 1.427905 0.228481
C  -4.123302 -0.390183 0.435027
C  2.025511 3.578727 -0.903807
C  -3.850549 0.968745 0.384667
C  3.027548 4.49904 -0.240329
C  0.644024 3.697722 -0.288985
C  -0.80454 -0.188816 4.42903
H  2.380203 -0.85388 -3.072992
H  4.440563 -1.621016 -1.943341
H  -0.968916 -2.717018 -0.492035
H  1.174405 -0.822407 0.184538
H  2.518385 -3.864677 -2.719231
H  4.273684 -3.937826 -2.707795
H  3.450176 -2.869642 -3.838982
H  2.648652 -3.377627 -0.191803
H  3.532317 -1.97517 0.407873
H  4.403627 -3.351559 -0.239857
H  3.468048 0.085867 -0.58319
H  -1.293954 -3.003069 1.85909
H  0.42571 -3.156518 1.507175
H  -0.509904 0.884751 -0.002546
H  -3.292883 -2.351491 0.366532
H  -2.344801 2.488879 0.188071
H  -5.137722 -0.746673 0.553712
H  1.976419 3.809568 -1.971059
H  2.717518 5.535101 -0.375711
H  4.021575 4.391822 -0.676275
H  3.097906 4.309459 0.832382
H  -0.093514 3.092203 -0.813708
H  0.653881 3.40608 0.762843
H  0.310149 4.734628 -0.343618
H  -1.650413 -0.251149 5.107928
H  0.11924 -0.318369 4.993007
H  -0.802714 0.788798 3.946351
elementType: Cl O N C H
totalener: -1686.36465182 hartree
nucrepener: 2851.08352495 hartree
electener: -4537.44817677 hartree
oneelecener: -7978.12054613 hartree
twoeener: 3440.67236936 hartree
cpcmener: -0.04802020 hartree
kineticenergy: 1680.31887515 hartree
xcener: -138.342654400180 hartree
chargesum: -0.0000000
charge: -0.097123 -0.513709 -0.332537 -0.269947 -0.517325 -0.468868 -0.189642 -0.239583 0.108587 0.060577 0.113437 0.251597 -0.311980 -0.309818 -0.143436 0.019287 0.486511 -0.140972 -0.195649 0.412454 -0.186660 -0.163677 0.169426 0.120644 -0.257935 -0.280949 -0.123721 0.110227 0.057684 0.096262 0.185714 0.085700 0.095759 0.096599 0.085571 0.092617 0.108261 0.174608 0.110578 0.121831 0.166787 0.141608 0.134612 0.141264 0.068141 0.091065 0.096671 0.088666 0.086757 0.092301 0.108116 0.129256 0.118112 0.116246
qa: -0.0971 -0.5137 -0.3325 -0.2699 -0.5173 -0.4689 -0.1896 -0.2396 0.1086 0.0606 0.1134 0.2516 -0.3120 -0.3098 -0.1434 0.0193 0.4865 -0.1410 -0.1956 0.4125 -0.1867 -0.1637 0.1694 0.1206 -0.2579 -0.2809 -0.1237 0.1102 0.0577 0.0963 0.1857 0.0857 0.0958 0.0966 0.0856 0.0926 0.1083 0.1746 0.1106 0.1218 0.1668 0.1416 0.1346 0.1413 0.0681 0.0911 0.0967 0.0887 0.0868 0.0923 0.1081 0.1293 0.1181 0.1162
va: 1.2095 2.0160 2.0819 2.1377 1.9901 2.0158 3.1580 3.1729 3.8087 3.8392 3.8218 4.1840 3.9519 3.9473 3.9037 3.6749 4.3404 3.9433 3.9957 4.0965 4.0519 3.9997 3.8405 3.8501 3.9464 3.8703 3.8623 1.0371 1.0168 1.0447 1.0317 1.0134 1.0023 1.0029 1.0043 1.0108 1.0062 1.0223 1.0266 1.0135 0.9641 1.0025 1.0157 1.0063 1.0186 1.0056 1.0081 1.0057 1.0209 1.0058 1.0071 0.9945 0.9941 0.9930
dispcorr: -0.032211385 hartree
energy: -1686.396863200182
dipole: 35.13651 -33.51245 1.62407 -4.82072 4.64647 -0.17425 0.93024 2.01454 2.94478
magnitude: 3.36744 au
magnitude: 8.55936 debye
