program: Orca
programVersion: 5.0.2
elementType: Cl O O O O O N N C C C C C C C C C C C C C C C C C C C H H H H H H H H H H H H H H H H H H H H H H H H H H H
charge: 0
multiplicity: 1
keywords: wb97x-d3
keywords: def2-TZVPP
keywords: def2/J RIJCOSX
keywords: DEFGRID2
keywords: scfconv7
keywords: smallprint printgap noloewdin
keywords: NOSOSCF
formula: C19H27ClN2O5
InChI: InChI=1/C19H27ClN2O5/c1-11(2)17(22-19(25)27-12(3)4)18(24)21-15(10-16(23)26-5)13-6-8-14(20)9-7-13/h6-9,11-12,15,17,21-22H,10H2,1-5H3
54 atoms
Cl -6.747809 0.451879 -0.821623
O  1.281125 -2.339099 0.539232
O  3.470054 1.860219 -0.309628
O  1.632836 0.287524 2.169742
O  1.440364 1.640533 -1.270478
O  0.647764 -1.201107 3.50977
N  -0.202015 -0.841671 -0.272021
N  2.812184 -0.143618 -0.966108
C  1.884414 -1.138536 -1.465054
C  2.624815 -2.351125 -2.033198
C  -1.121407 -0.897289 0.847762
C  0.955286 -1.518535 -0.30805
C  3.595441 -1.933246 -3.131682
C  1.627877 -3.371434 -2.572118
C  -0.705484 0.059698 1.982993
C  -2.522803 -0.566089 0.393474
C  2.483794 1.160558 -0.867465
C  -3.567122 -1.44469 0.653475
C  -2.807268 0.63484 -0.251264
C  0.579692 -0.364017 2.643931
C  -4.869846 -1.14138 0.284863
C  -4.101062 0.950869 -0.633456
C  3.299615 3.282191 -0.124226
C  -5.125288 0.057874 -0.358069
C  4.6938 3.86991 -0.086332
C  2.519358 3.563077 1.144386
C  2.914962 -0.082234 2.67588
H  1.305105 -0.687323 -2.274827
H  3.195565 -2.817965 -1.223464
H  -1.118502 -1.917978 1.233437
H  -0.334177 -0.108124 -0.953194
H  4.089354 -2.810226 -3.552915
H  4.378319 -1.266888 -2.76965
H  3.075547 -1.424895 -3.947274
H  2.153316 -4.237332 -2.976904
H  1.026914 -2.946039 -3.379244
H  0.94534 -3.742047 -1.80679
H  3.649338 -0.469732 -0.504019
H  -0.628882 1.075185 1.591237
H  -1.487264 0.047318 2.743704
H  -3.369266 -2.383576 1.156033
H  -2.021118 1.351705 -0.460887
H  -5.670185 -1.837105 0.497998
H  -4.304526 1.887456 -1.134923
H  2.762658 3.689789 -0.983447
H  4.630784 4.952462 0.024503
H  5.240021 3.664078 -1.007561
H  5.272771 3.482025 0.753615
H  3.037364 3.177548 2.02448
H  2.409819 4.640935 1.270534
H  1.517099 3.136854 1.115135
H  3.14058 -1.128064 2.466018
H  3.636589 0.549147 2.166309
H  2.985947 0.093113 3.749622
elementType: Cl O N C H
totalener: -1686.36645150 hartree
nucrepener: 2815.87126996 hartree
electener: -4502.23772147 hartree
oneelecener: -7907.33559102 hartree
twoeener: 3405.09786956 hartree
cpcmener: -0.04429481 hartree
kineticenergy: 1680.30692024 hartree
xcener: -138.336106531336 hartree
chargesum: -0.0000000
charge: -0.096388 -0.515062 -0.332292 -0.255359 -0.533301 -0.451550 -0.163184 -0.210464 0.086188 0.080840 0.237467 0.193201 -0.295404 -0.301196 -0.157236 -0.004938 0.502053 -0.170142 -0.213340 0.375368 -0.153530 -0.180180 0.162641 0.107539 -0.255995 -0.281977 -0.135967 0.101232 0.045454 0.101198 0.183179 0.095362 0.090551 0.086310 0.094312 0.089852 0.096451 0.176049 0.112933 0.116894 0.143922 0.141742 0.143216 0.143289 0.072821 0.091384 0.096297 0.090177 0.089352 0.109499 0.091327 0.123045 0.104625 0.131736
qa: -0.0964 -0.5151 -0.3323 -0.2554 -0.5333 -0.4516 -0.1632 -0.2105 0.0862 0.0808 0.2375 0.1932 -0.2954 -0.3012 -0.1572 -0.0049 0.5021 -0.1701 -0.2133 0.3754 -0.1535 -0.1802 0.1626 0.1075 -0.2560 -0.2820 -0.1360 0.1012 0.0455 0.1012 0.1832 0.0954 0.0906 0.0863 0.0943 0.0899 0.0965 0.1760 0.1129 0.1169 0.1439 0.1417 0.1432 0.1433 0.0728 0.0914 0.0963 0.0902 0.0894 0.1095 0.0913 0.1230 0.1046 0.1317
va: 1.2075 1.9851 2.0782 2.1003 1.9623 2.0525 3.2574 3.1585 3.8230 3.8297 3.6865 4.2445 3.9483 3.9462 3.8951 3.5827 4.3101 3.9803 4.0157 4.1653 3.9939 4.0308 3.8018 3.8249 3.9436 3.9112 3.8438 1.0278 1.0377 1.0494 1.0167 1.0042 1.0117 1.0029 1.0034 1.0028 1.0142 1.0193 1.0137 1.0243 1.0033 1.0115 1.0064 1.0065 1.0240 1.0055 1.0082 1.0048 1.0028 1.0102 1.0153 1.0001 1.0084 0.9984
dispcorr: -0.032185871 hartree
energy: -1686.398637375882
dipole: 46.20906 -44.87420 1.33487 3.39286 -1.91995 1.47292 -5.06098 4.06330 -0.99769
magnitude: 2.22412 au
magnitude: 5.65328 debye
