program: Orca
programVersion: 5.0.2
elementType: Cl O O O O O N N C C C C C C C C C C C C C C C C C C C H H H H H H H H H H H H H H H H H H H H H H H H H H H
charge: 0
multiplicity: 1
keywords: wb97x-d3
keywords: def2-TZVPP
keywords: def2/J RIJCOSX
keywords: DEFGRID2
keywords: scfconv7
keywords: smallprint printgap noloewdin
keywords: NOSOSCF
formula: C19H27ClN2O5
InChI: InChI=1/C19H27ClN2O5/c1-11(2)17(22-19(25)27-12(3)4)18(24)21-15(10-16(23)26-5)13-6-8-14(20)9-7-13/h6-9,11-12,15,17,21-22H,10H2,1-5H3
54 atoms
Cl -7.047055 -1.099571 -0.987048
O  1.199133 -1.700258 0.533993
O  4.351011 1.38237 -0.081209
O  0.566881 -0.033053 3.202968
O  2.428313 2.17512 -0.962535
O  0.898728 1.725095 1.869959
N  -0.421511 -0.32966 -0.249972
N  2.933414 -0.042386 -0.978709
C  1.667993 -0.512327 -1.487818
C  1.868907 -1.710302 -2.427881
C  -1.343834 -0.515187 0.854196
C  0.789354 -0.905764 -0.301654
C  2.728529 -1.318267 -3.623152
C  0.526969 -2.265247 -2.892979
C  -1.24274 0.646141 1.861952
C  -2.764418 -0.664115 0.363581
C  3.170293 1.253404 -0.686098
C  -3.386572 0.345762 -0.366118
C  -3.489027 -1.811325 0.663111
C  0.178811 0.858811 2.304351
C  -4.69916 0.216339 -0.789385
C  -4.806748 -1.955989 0.252955
C  4.824675 2.698692 0.26919
C  -5.400979 -0.93661 -0.471487
C  6.335194 2.602871 0.307043
C  4.243784 3.132082 1.600132
C  1.929268 0.013851 3.626324
H  1.205463 0.296824 -2.057597
H  2.388338 -2.494454 -1.865134
H  -1.060154 -1.439081 1.357708
H  -0.643331 0.375459 -0.938175
H  2.88064 -2.176778 -4.278966
H  3.713458 -0.957276 -3.326612
H  2.248687 -0.533559 -4.213022
H  -0.069762 -1.49875 -3.392972
H  -0.068798 -2.672076 -2.07438
H  0.680528 -3.076872 -3.605304
H  3.57076 -0.736959 -0.615964
H  -1.597674 1.569196 1.402425
H  -1.882329 0.423993 2.718006
H  -2.854074 1.257943 -0.611395
H  -3.025696 -2.609527 1.230219
H  -5.168395 1.009707 -1.355411
H  -5.356836 -2.854211 0.499911
H  4.528954 3.404105 -0.510959
H  6.758009 3.580011 0.541132
H  6.741729 2.289116 -0.655259
H  6.67474 1.901475 1.071416
H  3.160725 3.235384 1.563117
H  4.498473 2.424602 2.391588
H  4.654053 4.103958 1.877415
H  2.614184 -0.127722 2.788319
H  2.159947 0.955688 4.126505
H  2.0510 -0.804985 4.331763
elementType: Cl O N C H
totalener: -1686.36632962 hartree
nucrepener: 2766.63287239 hartree
electener: -4452.99920202 hartree
oneelecener: -7809.97042096 hartree
twoeener: 3356.97121894 hartree
cpcmener: -0.04948678 hartree
kineticenergy: 1680.30945165 hartree
xcener: -138.334472905538 hartree
chargesum: 0.0000000
charge: -0.096083 -0.520138 -0.335261 -0.274308 -0.528912 -0.453932 -0.143016 -0.215841 0.084300 0.059848 0.226641 0.230289 -0.300621 -0.303460 -0.138940 -0.038585 0.498119 -0.216189 -0.163742 0.416739 -0.167724 -0.158525 0.168369 0.106529 -0.255005 -0.280913 -0.125272 0.097221 0.053853 0.096609 0.177176 0.095612 0.093948 0.086631 0.090367 0.094198 0.094094 0.168864 0.107867 0.112642 0.146317 0.143739 0.143651 0.143178 0.063291 0.090416 0.095504 0.087930 0.094341 0.088837 0.101652 0.105022 0.119771 0.132903
qa: -0.0961 -0.5201 -0.3353 -0.2743 -0.5289 -0.4539 -0.1430 -0.2158 0.0843 0.0598 0.2266 0.2303 -0.3006 -0.3035 -0.1389 -0.0386 0.4981 -0.2162 -0.1637 0.4167 -0.1677 -0.1585 0.1684 0.1065 -0.2550 -0.2809 -0.1253 0.0972 0.0539 0.0966 0.1772 0.0956 0.0939 0.0866 0.0904 0.0942 0.0941 0.1689 0.1079 0.1126 0.1463 0.1437 0.1437 0.1432 0.0633 0.0904 0.0955 0.0879 0.0943 0.0888 0.1017 0.1050 0.1198 0.1329
va: 1.2079 1.9983 2.0774 2.1275 1.9754 2.0536 3.2039 3.1712 3.8795 3.8089 3.6751 4.2014 3.9386 3.9542 3.8662 3.6213 4.3288 4.0164 3.9786 4.1411 4.0146 3.9968 3.8205 3.8294 3.9365 3.9039 3.8668 1.0403 1.0329 1.0633 1.0082 1.0049 1.0132 1.0008 1.0029 1.0095 1.0048 1.0315 1.0272 1.0258 1.0040 1.0031 1.0063 1.0066 1.0232 1.0059 1.0083 1.0065 1.0241 1.0048 1.0093 0.9980 0.9937 0.9951
dispcorr: -0.030347111 hartree
energy: -1686.396676733410
dipole: 46.67188 -46.49915 0.17272 5.61695 -6.07942 -0.46247 -2.34567 2.45400 0.10833
magnitude: 0.50541 au
magnitude: 1.28466 debye
