program: Orca
programVersion: 5.0.2
elementType: Cl O O O O O N N C C C C C C C C C C C C C C C C C C C H H H H H H H H H H H H H H H H H H H H H H H H H H H
charge: 0
multiplicity: 1
keywords: wb97x-d3
keywords: def2-TZVPP
keywords: def2/J RIJCOSX
keywords: DEFGRID2
keywords: scfconv7
keywords: smallprint printgap noloewdin
keywords: NOSOSCF
formula: C19H27ClN2O5
InChI: InChI=1/C19H27ClN2O5/c1-11(2)17(22-19(25)27-12(3)4)18(24)21-15(10-16(23)26-5)13-6-8-14(20)9-7-13/h6-9,11-12,15,17,21-22H,10H2,1-5H3
54 atoms
Cl -6.140816 -1.611232 -1.020561
O  1.154747 -1.34821 -0.893257
O  4.999593 0.670479 -1.968318
O  -2.62544 -0.658635 4.019479
O  4.352424 1.965602 -0.237461
O  -1.331383 0.918067 3.122447
N  0.231461 -0.266342 0.860321
N  2.872238 0.680101 -1.390836
C  1.717369 0.972886 -0.584634
C  0.729157 1.944293 -1.270336
C  -0.583855 -1.374517 1.297499
C  1.01859 -0.334338 -0.2245
C  0.113775 1.363003 -2.537061
C  1.405694 3.27825 -1.557779
C  -0.730342 -1.385704 2.827572
C  -1.94932 -1.412924 0.641124
C  4.096628 1.17261 -1.124162
C  -2.586828 -0.26346 0.188499
C  -2.624068 -2.626989 0.553976
C  -1.579185 -0.248252 3.328458
C  -3.87472 -0.318746 -0.326693
C  -3.908925 -2.700765 0.04119
C  6.365184 1.125256 -1.873789
C  -4.527955 -1.537681 -0.390353
C  6.528922 2.448463 -2.594848
C  7.21684 0.029181 -2.478253
C  -3.509624 0.337618 4.538045
H  2.061691 1.448292 0.336313
H  -0.075769 2.126347 -0.550512
H  -0.05433 -2.29265 1.037202
H  0.167599 0.607899 1.362147
H  -0.560071 2.088965 -2.994616
H  -0.470878 0.460812 -2.349963
H  0.875955 1.11984 -3.28077
H  1.833582 3.720145 -0.656642
H  0.682436 3.989501 -1.960046
H  2.20362 3.176892 -2.295914
H  2.779861 -0.016645 -2.115031
H  -1.155452 -2.342113 3.127956
H  0.259566 -1.308572 3.285755
H  -2.0892 0.697212 0.228045
H  -2.141767 -3.53676 0.892604
H  -4.35797 0.585628 -0.671317
H  -4.416426 -3.654154 -0.020368
H  6.629907 1.242986 -0.820382
H  5.911365 3.233044 -2.157219
H  6.272611 2.35622 -3.651933
H  7.567226 2.776549 -2.530477
H  6.988886 -0.123729 -3.534704
H  8.269959 0.30019 -2.400751
H  7.080915 -0.918031 -1.954646
H  -2.997015 1.006511 5.229637
H  -3.963207 0.920488 3.736227
H  -4.286164 -0.203175 5.071945
elementType: Cl O N C H
totalener: -1686.36741134 hartree
nucrepener: 2701.59084683 hartree
electener: -4387.95825817 hartree
oneelecener: -7678.95967716 hartree
twoeener: 3291.00141899 hartree
cpcmener: -0.04289846 hartree
kineticenergy: 1680.31118868 hartree
xcener: -138.339962889318 hartree
chargesum: -0.0000000
charge: -0.098001 -0.518813 -0.339324 -0.271037 -0.537906 -0.466141 -0.218498 -0.251801 0.109722 0.074954 0.169127 0.278507 -0.307419 -0.319893 -0.125359 0.085938 0.507785 -0.238849 -0.220687 0.411807 -0.164282 -0.147656 0.157454 0.107534 -0.262389 -0.253563 -0.124029 0.115241 0.047131 0.100030 0.182717 0.098110 0.090049 0.090946 0.098583 0.101288 0.087696 0.169715 0.102644 0.120966 0.153413 0.142150 0.141187 0.141980 0.063960 0.093124 0.087663 0.096150 0.087898 0.090029 0.095894 0.118086 0.117100 0.129071
qa: -0.0980 -0.5188 -0.3393 -0.2710 -0.5379 -0.4661 -0.2185 -0.2518 0.1097 0.0750 0.1691 0.2785 -0.3074 -0.3199 -0.1254 0.0859 0.5078 -0.2388 -0.2207 0.4118 -0.1643 -0.1477 0.1575 0.1075 -0.2624 -0.2536 -0.1240 0.1152 0.0471 0.1000 0.1827 0.0981 0.0900 0.0909 0.0986 0.1013 0.0877 0.1697 0.1026 0.1210 0.1534 0.1422 0.1412 0.1420 0.0640 0.0931 0.0877 0.0962 0.0879 0.0900 0.0959 0.1181 0.1171 0.1291
va: 1.2067 1.9870 2.0853 2.1377 1.9649 2.0234 3.2212 3.2006 3.7815 3.7799 3.7948 4.2849 3.9410 3.9484 3.9012 3.4900 4.3226 3.9720 4.0426 4.1086 4.0512 3.9863 3.8375 3.8286 3.9004 3.9388 3.8620 1.0422 1.0287 1.0327 1.0253 1.0040 1.0113 1.0070 1.0066 1.0053 1.0049 1.0399 1.0252 1.0150 1.0016 1.0028 1.0075 1.0060 1.0233 1.0193 1.0075 1.0067 1.0066 1.0054 1.0081 0.9937 0.9928 0.9945
dispcorr: -0.029113570 hartree
energy: -1686.396524909085
dipole: 39.10974 -39.73245 -0.62271 18.77194 -19.01194 -0.24000 -7.17954 8.44238 1.26284
magnitude: 1.42833 au
magnitude: 3.63054 debye
