program: Orca
programVersion: 5.0.2
elementType: Cl O O O O O N N C C C C C C C C C C C C C C C C C C C H H H H H H H H H H H H H H H H H H H H H H H H H H H
charge: 0
multiplicity: 1
keywords: wb97x-d3
keywords: def2-TZVPP
keywords: def2/J RIJCOSX
keywords: DEFGRID2
keywords: scfconv7
keywords: smallprint printgap noloewdin
keywords: NOSOSCF
formula: C19H27ClN2O5
InChI: InChI=1/C19H27ClN2O5/c1-11(2)17(22-19(25)27-12(3)4)18(24)21-15(10-16(23)26-5)13-6-8-14(20)9-7-13/h6-9,11-12,15,17,21-22H,10H2,1-5H3
54 atoms
Cl -6.182089 -0.661681 -0.73618
O  0.669469 -0.751039 -1.458238
O  4.397068 1.414081 -2.636417
O  -2.142373 -2.082467 3.868502
O  4.509677 1.636569 -0.394822
O  -0.699608 -0.415218 3.541779
N  0.412039 -0.663363 0.778218
N  2.549471 1.18593 -1.456451
C  1.732276 1.064658 -0.278772
C  0.829651 2.296862 -0.040272
C  -0.477536 -1.800134 0.844658
C  0.894918 -0.207134 -0.387066
C  -0.193144 2.502723 -1.151383
C  1.673408 3.549815 0.154412
C  -0.46821 -2.42196 2.249215
C  -1.892382 -1.474443 0.409685
C  3.873179 1.425837 -1.409949
C  -2.451609 -0.215823 0.602127
C  -2.680767 -2.47493 -0.149631
C  -1.100278 -1.526776 3.281043
C  -3.769523 0.0408 0.251253
C  -3.999426 -2.237022 -0.503904
C  5.819816 1.600368 -2.782296
C  -4.53444 -0.975053 -0.297095
C  6.036026 2.095037 -4.19627
C  6.551017 0.301052 -2.507804
C  -2.852171 -1.305756 4.835507
H  2.39506 0.967582 0.584125
H  0.289044 2.111293 0.89416
H  -0.087232 -2.569382 0.174581
H  0.60666 -0.149621 1.625249
H  -0.870527 1.655115 -1.266788
H  0.289121 2.680014 -2.115189
H  -0.809784 3.376741 -0.936293
H  1.036071 4.398328 0.408565
H  2.216015 3.815375 -0.754886
H  2.400219 3.432497 0.959625
H  2.132763 0.958085 -2.34703
H  -0.983709 -3.379995 2.202898
H  0.56478 -2.61885 2.548503
H  -1.864324 0.590722 1.022731
H  -2.262899 -3.460743 -0.318168
H  -4.18768 1.026441 0.405649
H  -4.596588 -3.026284 -0.940688
H  6.152477 2.367716 -2.079138
H  5.710342 1.360293 -4.934777
H  7.097254 2.283587 -4.359439
H  5.503347 3.029037 -4.379842
H  7.623616 0.447824 -2.641105
H  6.394482 -0.050474 -1.487958
H  6.232979 -0.483937 -3.196362
H  -2.21482 -1.028867 5.675258
H  -3.274067 -0.406274 4.386148
H  -3.65951 -1.939863 5.191345
elementType: Cl O N C H
totalener: -1686.36754535 hartree
nucrepener: 2714.34291655 hartree
electener: -4400.71046190 hartree
oneelecener: -7704.57529598 hartree
twoeener: 3303.86483408 hartree
cpcmener: -0.04336193 hartree
kineticenergy: 1680.31055463 hartree
xcener: -138.339953642776 hartree
chargesum: -0.0000000
charge: -0.098596 -0.514712 -0.340388 -0.270340 -0.539154 -0.462427 -0.213095 -0.251784 0.120663 0.073732 0.161962 0.266097 -0.311958 -0.321350 -0.123461 0.090206 0.508106 -0.257893 -0.224752 0.404589 -0.158574 -0.141994 0.159524 0.101706 -0.253698 -0.262407 -0.121980 0.117375 0.046065 0.104545 0.183115 0.092245 0.091407 0.099028 0.101687 0.087757 0.099017 0.170004 0.102657 0.122887 0.160184 0.142040 0.142533 0.142913 0.062428 0.088191 0.089819 0.095777 0.095671 0.093255 0.087803 0.117852 0.116211 0.129509
qa: -0.0986 -0.5147 -0.3404 -0.2703 -0.5392 -0.4624 -0.2131 -0.2518 0.1207 0.0737 0.1620 0.2661 -0.3120 -0.3214 -0.1235 0.0902 0.5081 -0.2579 -0.2248 0.4046 -0.1586 -0.1420 0.1595 0.1017 -0.2537 -0.2624 -0.1220 0.1174 0.0461 0.1045 0.1831 0.0922 0.0914 0.0990 0.1017 0.0878 0.0990 0.1700 0.1027 0.1229 0.1602 0.1420 0.1425 0.1429 0.0624 0.0882 0.0898 0.0958 0.0957 0.0933 0.0878 0.1179 0.1162 0.1295
va: 1.2058 1.9893 2.0864 2.1362 1.9627 2.0273 3.2197 3.2059 3.7636 3.7719 3.8267 4.2972 3.9429 3.9465 3.8948 3.4173 4.3229 3.9780 4.0537 4.1215 4.0459 3.9810 3.8365 3.8291 3.9372 3.8983 3.8601 1.0401 1.0308 1.0216 1.0255 1.0084 1.0084 1.0036 1.0049 1.0048 1.0067 1.0400 1.0267 1.0138 0.9947 1.0030 1.0068 1.0054 1.0233 1.0065 1.0055 1.0083 1.0064 1.0198 1.0078 0.9940 0.9929 0.9944
dispcorr: -0.029454063 hartree
energy: -1686.396999414917
dipole: 38.39571 -38.86111 -0.46540 15.37982 -16.19738 -0.81757 -3.84606 5.15622 1.31017
magnitude: 1.61293 au
magnitude: 4.09974 debye
