program: Orca
programVersion: 5.0.2
elementType: Cl O O O O O N N C C C C C C C C C C C C C C C C C C C H H H H H H H H H H H H H H H H H H H H H H H H H H H
charge: 0
multiplicity: 1
keywords: wb97x-d3
keywords: def2-TZVPP
keywords: def2/J RIJCOSX
keywords: DEFGRID2
keywords: scfconv7
keywords: smallprint printgap noloewdin
keywords: NOSOSCF
formula: C19H27ClN2O5
InChI: InChI=1/C19H27ClN2O5/c1-11(2)17(22-19(25)27-12(3)4)18(24)21-15(10-16(23)26-5)13-6-8-14(20)9-7-13/h6-9,11-12,15,17,21-22H,10H2,1-5H3
54 atoms
Cl -6.230728 -1.148464 -0.861037
O  0.913505 -1.124091 -1.255536
O  4.75289 0.880562 -2.313117
O  -2.335833 -1.360155 4.027583
O  4.440767 1.73165 -0.246479
O  -0.951999 0.269578 3.399826
N  0.296971 -0.48129 0.816556
N  2.720168 0.878657 -1.465951
C  1.703059 1.010115 -0.458164
C  0.733857 2.18327 -0.730782
C  -0.543602 -1.626214 1.075364
C  0.942492 -0.307817 -0.346028
C  -0.065578 1.999917 -2.014891
C  1.489442 3.506205 -0.746132
C  -0.577566 -1.95102 2.577021
C  -1.951805 -1.471659 0.535546
C  4.007596 1.210193 -1.256483
C  -2.538313 -0.227657 0.336355
C  -2.708475 -2.613057 0.287276
C  -1.291818 -0.89116 3.371162
C  -3.853275 -0.120398 -0.095716
C  -4.021758 -2.5246 -0.143013
C  6.157046 1.206195 -2.298395
C  -4.585906 -1.271735 -0.327854
C  6.360427 2.64909 -2.715624
C  6.826023 0.229291 -3.240795
C  -3.099216 -0.435758 4.805257
H  2.197407 1.204487 0.49644
H  0.033087 2.209444 0.110503
H  -0.086474 -2.489799 0.588963
H  0.352035 0.240446 1.520902
H  -0.696125 1.109497 -1.998074
H  0.586078 1.933363 -2.888633
H  -0.725295 2.854515 -2.171923
H  2.057108 3.661589 0.172707
H  0.791877 4.339181 -0.845393
H  2.18389 3.56424 -1.586154
H  2.480377 0.39003 -2.316118
H  -1.053692 -2.920524 2.713307
H  0.446503 -2.03279 2.95069
H  -1.976394 0.681143 0.510744
H  -2.268014 -3.593154 0.428792
H  -4.29526 0.85536 -0.246594
H  -4.594536 -3.422113 -0.334081
H  6.548547 1.05432 -1.290059
H  5.984999 2.824694 -3.725444
H  7.424453 2.888783 -2.708516
H  5.86498 3.344298 -2.037373
H  7.90152 0.407886 -3.24925
H  6.665491 -0.802447 -2.925742
H  6.460868 0.339926 -4.263433
H  -3.901563 -1.015737 5.253473
H  -2.497475 0.015316 5.594466
H  -3.527885 0.348386 4.18054
elementType: Cl O N C H
totalener: -1686.36761420 hartree
nucrepener: 2705.87916694 hartree
electener: -4392.24678114 hartree
oneelecener: -7687.54881445 hartree
twoeener: 3295.30203331 hartree
cpcmener: -0.04301914 hartree
kineticenergy: 1680.32456814 hartree
xcener: -138.342487828726 hartree
chargesum: -0.0000000
charge: -0.098303 -0.517417 -0.339373 -0.270441 -0.537633 -0.465706 -0.221141 -0.254058 0.114149 0.074183 0.168363 0.274091 -0.309773 -0.320880 -0.127668 0.077366 0.507937 -0.232372 -0.223358 0.411321 -0.167387 -0.147448 0.157722 0.109496 -0.263058 -0.253615 -0.124373 0.116194 0.047989 0.102369 0.185613 0.091110 0.090976 0.098311 0.098712 0.101800 0.087791 0.169999 0.102555 0.122251 0.159034 0.141737 0.141485 0.141931 0.063613 0.087863 0.095969 0.093217 0.089936 0.096213 0.088028 0.129261 0.118686 0.116730
qa: -0.0983 -0.5174 -0.3394 -0.2704 -0.5376 -0.4657 -0.2211 -0.2541 0.1141 0.0742 0.1684 0.2741 -0.3098 -0.3209 -0.1277 0.0774 0.5079 -0.2324 -0.2234 0.4113 -0.1674 -0.1474 0.1577 0.1095 -0.2631 -0.2536 -0.1244 0.1162 0.0480 0.1024 0.1856 0.0911 0.0910 0.0983 0.0987 0.1018 0.0878 0.1700 0.1026 0.1223 0.1590 0.1417 0.1415 0.1419 0.0636 0.0879 0.0960 0.0932 0.0899 0.0962 0.0880 0.1293 0.1187 0.1167
va: 1.2063 1.9882 2.0855 2.1375 1.9651 2.0236 3.2192 3.2013 3.7726 3.7748 3.8052 4.2883 3.9423 3.9478 3.9021 3.4752 4.3229 3.9644 4.0468 4.1079 4.0527 3.9869 3.8366 3.8233 3.9028 3.9375 3.8618 1.0413 1.0295 1.0272 1.0250 1.0102 1.0078 1.0038 1.0066 1.0052 1.0047 1.0399 1.0255 1.0152 0.9947 1.0032 1.0076 1.0059 1.0240 1.0074 1.0068 1.0186 1.0055 1.0080 1.0067 0.9944 0.9934 0.9931
dispcorr: -0.029202714 hartree
energy: -1686.396816913020
dipole: 38.90258 -39.45441 -0.55183 18.66976 -19.14731 -0.47755 -5.96245 7.28083 1.31838
magnitude: 1.50688 au
magnitude: 3.83019 debye
