program: Orca
programVersion: 5.0.2
elementType: Cl O O O O O N N C C C C C C C C C C C C C C C C C C C H H H H H H H H H H H H H H H H H H H H H H H H H H H
charge: 0
multiplicity: 1
keywords: wb97x-d3
keywords: def2-TZVPP
keywords: def2/J RIJCOSX
keywords: DEFGRID2
keywords: scfconv7
keywords: smallprint printgap noloewdin
keywords: NOSOSCF
formula: C19H27ClN2O5
InChI: InChI=1/C19H27ClN2O5/c1-11(2)17(22-19(25)27-12(3)4)18(24)21-15(10-16(23)26-5)13-6-8-14(20)9-7-13/h6-9,11-12,15,17,21-22H,10H2,1-5H3
54 atoms
Cl -5.64209 1.084644 -0.257795
O  -0.074652 -2.17903 -2.148061
O  2.893606 1.983192 -0.482576
O  -0.846184 -0.058704 3.442806
O  1.118449 1.510821 -1.799895
O  1.023152 0.212789 2.259999
N  0.656254 -1.434942 -0.152085
N  2.684596 -0.051685 -1.31924
C  2.069134 -1.095608 -2.105495
C  3.08678 -2.233489 -2.335011
C  -0.479415 -1.90546 0.604206
C  0.775105 -1.613556 -1.474343
C  2.642645 -3.191076 -3.433502
C  3.437593 -3.00212 -1.064561
C  -0.150893 -1.87303 2.106153
C  -1.757791 -1.137727 0.329914
C  2.14917 1.184877 -1.243386
C  -2.9785 -1.759276 0.575652
C  -1.757992 0.182342 -0.101878
C  0.084359 -0.470043 2.60253
C  -4.175817 -1.085228 0.402217
C  -2.948802 0.87212 -0.285119
C  2.460182 3.344359 -0.26935
C  -4.149425 0.231855 -0.029336
C  3.703954 4.126482 0.09511
C  1.407399 3.401426 0.820609
C  -0.734686 1.272356 3.953354
H  1.791207 -0.696827 -3.085641
H  3.993544 -1.731659 -2.69035
H  -0.657273 -2.954689 0.351947
H  1.383654 -0.935211 0.336196
H  3.446417 -3.892813 -3.6568
H  2.401793 -2.663518 -4.356799
H  1.771673 -3.777678 -3.144742
H  4.251289 -3.69941 -1.268474
H  2.593446 -3.590722 -0.700154
H  3.771556 -2.358578 -0.248344
H  3.590368 -0.2142 -0.904308
H  -0.96738 -2.345223 2.649827
H  0.753357 -2.459302 2.288034
H  -3.000597 -2.791615 0.905448
H  -0.827976 0.691746 -0.316693
H  -5.115528 -1.585242 0.595414
H  -2.932417 1.89825 -0.627672
H  2.049017 3.735594 -1.202792
H  4.45989 4.067019 -0.688804
H  4.143332 3.770259 1.028331
H  3.448485 5.177812 0.227017
H  1.7951 3.011427 1.762189
H  1.112836 4.438371 0.985384
H  0.507523 2.847454 0.555056
H  -0.790759 2.010216 3.152502
H  -1.58005 1.405423 4.622757
H  0.191525 1.40988 4.511316
elementType: Cl O N C H
totalener: -1686.36634119 hartree
nucrepener: 2866.56866397 hartree
electener: -4552.93500516 hartree
oneelecener: -8009.97087670 hartree
twoeener: 3457.03587154 hartree
cpcmener: -0.04771311 hartree
kineticenergy: 1680.31096845 hartree
xcener: -138.340899801633 hartree
chargesum: 0.0000000
charge: -0.100618 -0.509541 -0.330432 -0.267460 -0.519283 -0.465580 -0.193067 -0.236926 0.109868 0.058757 0.149930 0.242026 -0.313331 -0.307843 -0.134236 0.001971 0.491474 -0.199058 -0.136202 0.407232 -0.163277 -0.191552 0.178252 0.128045 -0.259005 -0.276847 -0.126447 0.109836 0.058039 0.104637 0.180792 0.096390 0.096929 0.085827 0.105186 0.088285 0.092905 0.175561 0.105371 0.124264 0.141236 0.131439 0.140711 0.138992 0.065298 0.096305 0.089361 0.091344 0.082527 0.106089 0.087917 0.115257 0.132611 0.120040
qa: -0.1006 -0.5095 -0.3304 -0.2675 -0.5193 -0.4656 -0.1931 -0.2369 0.1099 0.0588 0.1499 0.2420 -0.3133 -0.3078 -0.1342 0.0020 0.4915 -0.1991 -0.1362 0.4072 -0.1633 -0.1916 0.1783 0.1280 -0.2590 -0.2768 -0.1264 0.1098 0.0580 0.1046 0.1808 0.0964 0.0969 0.0858 0.1052 0.0883 0.0929 0.1756 0.1054 0.1243 0.1412 0.1314 0.1407 0.1390 0.0653 0.0963 0.0894 0.0913 0.0825 0.1061 0.0879 0.1153 0.1326 0.1200
va: 1.2038 2.0172 2.0895 2.1345 1.9853 2.0288 3.1614 3.1636 3.8133 3.8414 3.8153 4.1890 3.9522 3.9460 3.8972 3.4958 4.3283 4.0255 3.9056 4.1079 4.0053 4.0713 3.8187 3.8006 3.9430 3.8968 3.8613 1.0356 1.0163 1.0153 1.0442 1.0022 1.0033 1.0136 1.0050 1.0062 1.0076 1.0219 1.0274 1.0150 1.0025 1.0144 1.0066 1.0090 1.0224 1.0082 1.0056 1.0055 1.0144 1.0099 1.0093 0.9888 0.9954 0.9936
dispcorr: -0.032715979 hartree
energy: -1686.399057169292
dipole: 38.69245 -36.30922 2.38323 -1.56299 1.34012 -0.22287 2.48880 0.24963 2.73843
magnitude: 3.63710 au
magnitude: 9.24476 debye
