program: Orca
programVersion: 5.0.2
elementType: Cl O O O O O N N C C C C C C C C C C C C C C C C C C C H H H H H H H H H H H H H H H H H H H H H H H H H H H
charge: 0
multiplicity: 1
keywords: wb97x-d3
keywords: def2-TZVPP
keywords: def2/J RIJCOSX
keywords: DEFGRID2
keywords: scfconv7
keywords: smallprint printgap noloewdin
keywords: NOSOSCF
formula: C19H27ClN2O5
InChI: InChI=1/C19H27ClN2O5/c1-11(2)17(22-19(25)27-12(3)4)18(24)21-15(10-16(23)26-5)13-6-8-14(20)9-7-13/h6-9,11-12,15,17,21-22H,10H2,1-5H3
54 atoms
Cl -5.74703 0.993647 -0.0535
O  -0.198409 -2.47076 -1.953041
O  2.939412 1.844527 -0.616291
O  -0.834602 0.158301 3.437521
O  1.115992 1.523484 -1.908442
O  0.990532 0.364724 2.174084
N  0.558406 -1.480452 -0.073747
N  2.531639 -0.177284 -1.405714
C  1.815718 -1.189151 -2.142394
C  2.754921 -2.319284 -2.601604
C  -0.528925 -1.909491 0.772703
C  0.623558 -1.770087 -1.378751
C  3.351595 -3.114291 -1.444832
C  3.844228 -1.779453 -3.520888
C  -0.128614 -1.752711 2.249858
C  -1.827428 -1.17502 0.501193
C  2.113775 1.106259 -1.353063
C  -1.858738 0.097652 -0.055282
C  -3.028786 -1.766579 0.880242
C  0.083037 -0.306664 2.612492
C  -3.060354 0.770643 -0.229193
C  -4.236605 -1.108839 0.715654
C  2.662768 3.252472 -0.454584
C  -4.241118 0.161687 0.160669
C  3.992434 3.903852 -0.142001
C  1.641619 3.473061 0.644215
C  -0.755389 1.537086 3.806172
H  1.393928 -0.733192 -3.042145
H  2.129525 -2.997686 -3.187225
H  -0.699474 -2.976916 0.609983
H  1.2590 -0.871593 0.32143
H  3.971522 -3.924571 -1.830761
H  2.586733 -3.57021 -0.814363
H  3.993587 -2.506219 -0.802783
H  4.552409 -1.140554 -2.989806
H  3.4242 -1.197903 -4.343619
H  4.41386 -2.601698 -3.956209
H  3.394351 -0.420664 -0.941411
H  -0.901914 -2.201536 2.871027
H  0.801792 -2.296792 2.429361
H  -0.946246 0.583538 -0.375641
H  -3.028449 -2.761543 1.310328
H  -3.066807 1.759483 -0.667883
H  -5.160958 -1.585315 1.01358
H  2.280972 3.649041 -1.398133
H  4.712662 3.752517 -0.94688
H  4.421475 3.51664 0.783959
H  3.854208 4.978348 -0.020957
H  1.449147 4.5417 0.746619
H  0.689029 2.99158 0.424671
H  2.005183 3.106469 1.605187
H  0.178611 1.760168 4.321923
H  -0.853942 2.185684 2.935182
H  -1.588917 1.713337 4.480219
elementType: Cl O N C H
totalener: -1686.36825906 hartree
nucrepener: 2853.29265542 hartree
electener: -4539.66091448 hartree
oneelecener: -7983.07224630 hartree
twoeener: 3443.41133182 hartree
cpcmener: -0.04644183 hartree
kineticenergy: 1680.30925309 hartree
xcener: -138.341000977291 hartree
chargesum: -0.0000000
charge: -0.099607 -0.520631 -0.328797 -0.266385 -0.521212 -0.467545 -0.202373 -0.263285 0.119869 0.064149 0.162436 0.246082 -0.302589 -0.303184 -0.136328 0.003225 0.499299 -0.146526 -0.201625 0.410325 -0.191025 -0.159133 0.175455 0.125566 -0.257228 -0.276259 -0.127320 0.108737 0.049329 0.104947 0.184486 0.101169 0.093792 0.082464 0.083342 0.097222 0.098984 0.182643 0.106804 0.124036 0.138197 0.141115 0.139358 0.141063 0.064367 0.096338 0.089033 0.090478 0.106453 0.088469 0.082971 0.120852 0.115395 0.132605
qa: -0.0996 -0.5206 -0.3288 -0.2664 -0.5212 -0.4675 -0.2024 -0.2633 0.1199 0.0641 0.1624 0.2461 -0.3026 -0.3032 -0.1363 0.0032 0.4993 -0.1465 -0.2016 0.4103 -0.1910 -0.1591 0.1755 0.1256 -0.2572 -0.2763 -0.1273 0.1087 0.0493 0.1049 0.1845 0.1012 0.0938 0.0825 0.0833 0.0972 0.0990 0.1826 0.1068 0.1240 0.1382 0.1411 0.1394 0.1411 0.0644 0.0963 0.0890 0.0905 0.1065 0.0885 0.0830 0.1209 0.1154 0.1326
va: 1.2048 2.0091 2.0875 2.1361 1.9832 2.0283 3.1634 3.1601 3.7927 3.7934 3.8144 4.2415 3.9448 3.9455 3.8969 3.4961 4.3140 3.9125 4.0281 4.1062 4.0712 4.0004 3.8187 3.8003 3.9423 3.8958 3.8608 1.0373 1.0352 1.0162 1.0462 1.0038 1.0118 1.0035 1.0063 1.0037 1.0040 1.0205 1.0270 1.0167 1.0108 1.0028 1.0086 1.0063 1.0230 1.0080 1.0063 1.0056 1.0094 1.0130 1.0133 0.9933 0.9898 0.9953
dispcorr: -0.032176428 hartree
energy: -1686.400435487385
dipole: 42.20722 -39.95013 2.25709 1.81565 -1.83380 -0.01815 -0.22401 2.84509 2.62108
magnitude: 3.45902 au
magnitude: 8.79214 debye
