program: Orca
programVersion: 5.0.2
elementType: Cl O O O O O N N C C C C C C C C C C C C C C C C C C C H H H H H H H H H H H H H H H H H H H H H H H H H H H
charge: 0
multiplicity: 1
keywords: wb97x-d3
keywords: def2-TZVPP
keywords: def2/J RIJCOSX
keywords: DEFGRID2
keywords: scfconv7
keywords: smallprint printgap noloewdin
keywords: NOSOSCF
formula: C19H27ClN2O5
InChI: InChI=1/C19H27ClN2O5/c1-11(2)17(22-19(25)27-12(3)4)18(24)21-15(10-16(23)26-5)13-6-8-14(20)9-7-13/h6-9,11-12,15,17,21-22H,10H2,1-5H3
54 atoms
Cl -6.540393 0.833672 -0.822611
O  1.259321 -2.499929 0.482267
O  3.125552 2.034631 -0.512976
O  0.770137 -1.28698 3.329739
O  1.20747 1.47852 -1.557429
O  1.886509 0.21495 2.104708
N  -0.095224 -0.86237 -0.298617
N  2.758739 -0.087965 -0.992282
C  1.995253 -1.233224 -1.447071
C  2.912715 -2.384763 -1.859076
C  -0.999854 -0.845133 0.8283
C  1.019467 -1.625707 -0.327105
C  3.954418 -1.923432 -2.873934
C  2.092337 -3.534899 -2.436729
C  -0.508312 0.10205 1.944953
C  -2.382963 -0.431271 0.388523
C  2.268018 1.17259 -1.04795
C  -2.593048 0.763244 -0.295086
C  -3.483538 -1.221807 0.689913
C  0.853563 -0.292533 2.455056
C  -3.86557 1.155659 -0.673986
C  -4.765322 -0.840482 0.32417
C  2.721571 3.406166 -0.381658
C  -4.948549 0.349235 -0.358892
C  4.000152 4.210346 -0.260654
C  1.814565 3.577753 0.823625
C  1.993839 -1.876767 3.748515
H  1.429944 -0.914662 -2.327913
H  3.425426 -2.751342 -0.963568
H  -1.043683 -1.859136 1.228663
H  -0.121333 -0.077499 -0.934625
H  3.479244 -1.531721 -3.776185
H  4.585382 -2.760691 -3.174415
H  4.607311 -1.143827 -2.484277
H  1.549736 -3.218172 -3.330739
H  1.372971 -3.931635 -1.723015
H  2.745685 -4.357376 -2.729133
H  3.500358 -0.260393 -0.331384
H  -0.453353 1.121044 1.559851
H  -1.236717 0.086116 2.75777
H  -1.759842 1.411757 -0.544819
H  -3.343655 -2.156373 1.219209
H  -4.014541 2.083314 -1.208966
H  -5.612867 -1.466982 0.56494
H  2.188464 3.708092 -1.286609
H  3.763637 5.272655 -0.202354
H  4.648559 4.059394 -1.123448
H  4.556183 3.941443 0.638551
H  2.29917 3.22159 1.732478
H  1.568803 4.631975 0.954912
H  0.879442 3.034179 0.700077
H  2.627158 -1.162261 4.275573
H  1.720662 -2.684195 4.422675
H  2.539618 -2.28383 2.898111
totalener: -1686.33522734 hartree
nucrepener: 2822.03268228 hartree
electener: -4508.36790962 hartree
oneelecener: -7919.81337403 hartree
twoeener: 3411.44546441 hartree
kineticenergy: 1680.39301628 hartree
xcener: -138.346051788484 hartree
chargesum: -0.0000000
charge: -0.076255 -0.421957 -0.301858 -0.254613 -0.478422 -0.377999 -0.184067 -0.199720 0.047156 0.052270 0.152819 0.182514 -0.253508 -0.289108 -0.153237 0.034953 0.482123 -0.196517 -0.141117 0.356789 -0.168851 -0.134199 0.150118 0.096686 -0.237306 -0.262355 -0.123872 0.098886 0.045080 0.104107 0.179983 0.077181 0.086427 0.084476 0.078683 0.105192 0.082278 0.147780 0.101119 0.109195 0.121062 0.115863 0.122052 0.120813 0.065768 0.077262 0.091394 0.085151 0.095719 0.090742 0.078986 0.107353 0.114061 0.112917
qa: -0.0763 -0.4220 -0.3019 -0.2546 -0.4784 -0.3780 -0.1841 -0.1997 0.0472 0.0523 0.1528 0.1825 -0.2535 -0.2891 -0.1532 0.0350 0.4821 -0.1965 -0.1411 0.3568 -0.1689 -0.1342 0.1501 0.0967 -0.2373 -0.2624 -0.1239 0.0989 0.0451 0.1041 0.1800 0.0772 0.0864 0.0845 0.0787 0.1052 0.0823 0.1478 0.1011 0.1092 0.1211 0.1159 0.1221 0.1208 0.0658 0.0773 0.0914 0.0852 0.0957 0.0907 0.0790 0.1074 0.1141 0.1129
va: 1.2291 2.0712 2.1142 2.1396 2.0130 2.0952 3.2027 3.1451 3.8550 3.8885 3.8122 4.2517 3.9338 3.9515 3.9161 3.6041 4.3193 4.0408 4.0111 4.1609 4.0909 4.0219 3.8595 3.9217 3.9403 3.9120 3.8885 1.0284 1.0326 1.0469 1.0430 1.0062 1.0072 1.0180 1.0051 1.0188 1.0056 1.0438 1.0093 1.0325 1.0211 1.0112 1.0143 1.0138 1.0218 1.0080 1.0107 1.0079 1.0136 1.0118 1.0133 0.9947 0.9960 1.0016
dispcorr: -0.031434348 hartree
energy: -1686.366661684859
dipole: 42.68410 -42.14915 0.53495 -0.97089 1.16483 0.19394 -1.95590 2.39144 0.43554
magnitude: 0.71657 au
magnitude: 1.82139 debye
