program: Orca
programVersion: 5.0.2
elementType: Cl O O O O O N N C C C C C C C C C C C C C C C C C C C H H H H H H H H H H H H H H H H H H H H H H H H H H H
charge: 0
multiplicity: 1
keywords: wb97x-d3
keywords: def2-TZVPP
keywords: def2/J RIJCOSX
keywords: DEFGRID2
keywords: scfconv7
keywords: smallprint printgap noloewdin
keywords: NOSOSCF
formula: C19H27ClN2O5
InChI: InChI=1/C19H27ClN2O5/c1-11(2)17(22-19(25)27-12(3)4)18(24)21-15(10-16(23)26-5)13-6-8-14(20)9-7-13/h6-9,11-12,15,17,21-22H,10H2,1-5H3
54 atoms
Cl -6.285342 -2.65015 -0.332775
O  0.435691 -1.853969 -0.246587
O  4.38904 0.272939 0.324836
O  0.0497 3.382445 1.173665
O  2.744196 1.684073 -0.313149
O  0.483304 1.877453 2.771677
N  -0.21634 0.30717 -0.290845
N  2.885626 -0.429467 -1.13471
C  1.585534 -0.399984 -1.769756
C  1.511388 -1.374827 -2.945931
C  -1.105114 0.176308 0.844573
C  0.53902 -0.736469 -0.704286
C  2.595056 -1.077349 -3.97623
C  0.127961 -1.314164 -3.587998
C  -1.442468 1.571663 1.378543
C  -2.373512 -0.570757 0.505686
C  3.29263 0.604983 -0.354591
C  -2.914521 -1.46179 1.422185
C  -3.055237 -0.343052 -0.682796
C  -0.199126 2.279279 1.869661
C  -4.115637 -2.105548 1.174067
C  -4.256411 -0.980074 -0.949204
C  4.912815 1.209405 1.281844
C  -4.783593 -1.855603 -0.012929
C  6.388175 0.892642 1.420098
C  4.167913 1.082917 2.597813
C  1.219216 4.12007 1.522347
H  1.433774 0.61139 -2.15692
H  1.657399 -2.387463 -2.554928
H  -0.584822 -0.372656 1.635128
H  0.054326 1.229239 -0.593986
H  2.534739 -1.782028 -4.806159
H  3.597994 -1.145724 -3.557099
H  2.47948 -0.072802 -4.389311
H  -0.665988 -1.593503 -2.89495
H  0.070104 -1.998261 -4.434648
H  -0.086168 -0.311393 -3.966045
H  3.267898 -1.339448 -0.927595
H  -1.962019 2.156242 0.6169
H  -2.12587 1.458715 2.221731
H  -2.386168 -1.668083 2.345121
H  -2.641587 0.331709 -1.422276
H  -4.523943 -2.801891 1.893203
H  -4.778952 -0.798919 -1.878279
H  4.795134 2.222062 0.888135
H  6.906896 0.980111 0.465634
H  6.544177 -0.11616 1.804465
H  6.851395 1.590268 2.117691
H  4.585732 1.777843 3.327301
H  3.107949 1.312139 2.498898
H  4.265422 0.075698 3.005602
H  1.219876 4.994581 0.877769
H  1.192908 4.436023 2.565107
H  2.118188 3.53464 1.340382
totalener: -1686.33422623 hartree
nucrepener: 2780.40958876 hartree
electener: -4466.74381499 hartree
oneelecener: -7836.35097071 hartree
twoeener: 3369.60715572 hartree
kineticenergy: 1680.40303032 hartree
xcener: -138.340103361416 hartree
chargesum: -0.0000000
charge: -0.081513 -0.389880 -0.313042 -0.261155 -0.467287 -0.368917 -0.178430 -0.232271 0.069238 0.043963 0.102976 0.186554 -0.256756 -0.288454 -0.112466 0.115163 0.497004 -0.166734 -0.240496 0.331553 -0.124660 -0.134063 0.129244 0.088918 -0.232287 -0.238339 -0.117072 0.080710 0.054658 0.111486 0.146096 0.087424 0.088176 0.075403 0.103927 0.088403 0.076898 0.148696 0.103101 0.098801 0.112620 0.114059 0.119211 0.119275 0.061694 0.091098 0.084259 0.078254 0.077462 0.097094 0.084717 0.116664 0.114527 0.104498
qa: -0.0815 -0.3899 -0.3130 -0.2612 -0.4673 -0.3689 -0.1784 -0.2323 0.0692 0.0440 0.1030 0.1866 -0.2568 -0.2885 -0.1125 0.1152 0.4970 -0.1667 -0.2405 0.3316 -0.1247 -0.1341 0.1292 0.0889 -0.2323 -0.2383 -0.1171 0.0807 0.0547 0.1115 0.1461 0.0874 0.0882 0.0754 0.1039 0.0884 0.0769 0.1487 0.1031 0.0988 0.1126 0.1141 0.1192 0.1193 0.0617 0.0911 0.0843 0.0783 0.0775 0.0971 0.0847 0.1167 0.1145 0.1045
va: 1.2240 2.1342 2.1028 2.1145 2.0328 2.1291 3.1290 3.1540 3.9246 3.8527 3.8592 4.2181 3.9371 3.9549 3.8278 3.4859 4.3109 4.0698 4.0409 4.1767 4.0083 4.0306 3.8777 3.9265 3.9365 3.9025 3.8781 1.0319 1.0361 1.0375 1.0442 1.0079 1.0178 1.0049 1.0114 1.0081 1.0051 1.0423 1.0285 1.0238 1.0141 1.0234 1.0133 1.0132 1.0154 1.0104 1.0095 1.0080 1.0098 1.0277 1.0123 0.9974 0.9960 0.9989
dispcorr: -0.030641604 hartree
energy: -1686.364867832724
dipole: 42.82015 -41.95772 0.86242 13.49207 -12.36629 1.12578 -5.71674 5.34535 -0.37140
magnitude: 1.46598 au
magnitude: 3.72622 debye
