program: Orca
programVersion: 5.0.2
elementType: Cl O O O O O N N C C C C C C C C C C C C C C C C C C C H H H H H H H H H H H H H H H H H H H H H H H H H H H
charge: 0
multiplicity: 1
keywords: wb97x-d3
keywords: def2-TZVPP
keywords: def2/J RIJCOSX
keywords: DEFGRID2
keywords: scfconv7
keywords: smallprint printgap noloewdin
keywords: NOSOSCF
formula: C19H27ClN2O5
InChI: InChI=1/C19H27ClN2O5/c1-11(2)17(22-19(25)27-12(3)4)18(24)21-15(10-16(23)26-5)13-6-8-14(20)9-7-13/h6-9,11-12,15,17,21-22H,10H2,1-5H3
54 atoms
Cl -6.554869 0.797692 -0.832399
O  1.255533 -2.499837 0.481059
O  3.134492 2.035776 -0.512008
O  0.756386 -1.282372 3.333981
O  1.212777 1.483337 -1.553342
O  1.870598 0.2191 2.106338
N  -0.096863 -0.860621 -0.300684
N  2.760935 -0.086477 -0.985659
C  1.997013 -1.229951 -1.444012
C  2.915298 -2.380599 -1.857091
C  -1.005812 -0.849271 0.82287
C  1.018343 -1.623954 -0.327279
C  3.954716 -1.91654 -2.873059
C  2.09711 -3.532593 -2.433736
C  -0.523487 0.098805 1.942703
C  -2.390484 -0.443488 0.380028
C  2.273559 1.175498 -1.044794
C  -2.60736 0.750483 -0.302259
C  -3.486575 -1.241385 0.678715
C  0.838449 -0.290052 2.456657
C  -3.881985 1.135443 -0.681832
C  -4.770353 -0.86769 0.312321
C  2.735177 3.408485 -0.379036
C  -4.960354 0.321987 -0.368745
C  4.016748 4.208517 -0.261845
C  1.832134 3.582036 0.828715
C  1.980635 -1.864683 3.760967
H  1.433589 -0.908706 -2.325073
H  3.430129 -2.746132 -0.962397
H  -1.04475 -1.864241 1.221462
H  -0.118414 -0.070895 -0.931992
H  4.589379 -2.751438 -3.171906
H  4.603537 -1.133072 -2.484619
H  3.477315 -1.528964 -3.775807
H  1.549471 -3.216443 -3.324782
H  1.382616 -3.933529 -1.71762
H  2.753085 -4.351334 -2.730596
H  3.495704 -0.260688 -0.317425
H  -0.472329 1.118735 1.559339
H  -1.254651 0.07772 2.752815
H  -1.778087 1.404664 -0.549995
H  -3.34126 -2.17577 1.206599
H  -4.036321 2.062908 -1.215449
H  -5.614088 -1.499925 0.551179
H  2.200136 3.711993 -1.282417
H  4.579007 3.930525 0.630462
H  3.783626 5.270959 -0.193047
H  4.657603 4.062725 -1.131034
H  2.3212 3.231165 1.737317
H  1.583439 4.636181 0.956065
H  0.898479 3.034551 0.710408
H  2.525721 -2.284107 2.916118
H  2.61338 -1.141862 4.276622
H  1.708484 -2.661994 4.447374
totalener: -1686.33530567 hartree
nucrepener: 2820.49516979 hartree
electener: -4506.83047546 hartree
oneelecener: -7916.74110974 hartree
twoeener: 3409.91063427 hartree
kineticenergy: 1680.39027808 hartree
xcener: -138.345449732593 hartree
chargesum: 0.0000000
charge: -0.076277 -0.421917 -0.302036 -0.254570 -0.478390 -0.378597 -0.184478 -0.199620 0.045540 0.052949 0.151964 0.183104 -0.253792 -0.289164 -0.152996 0.034466 0.482646 -0.195984 -0.141116 0.357988 -0.167949 -0.134424 0.149096 0.096524 -0.236955 -0.260639 -0.124054 0.098997 0.044696 0.104142 0.180398 0.086339 0.084904 0.077039 0.078712 0.105307 0.082152 0.147814 0.101065 0.109010 0.120804 0.115848 0.122071 0.120838 0.065718 0.085199 0.077065 0.091422 0.095205 0.090513 0.078851 0.113204 0.107291 0.114078
qa: -0.0763 -0.4219 -0.3020 -0.2546 -0.4784 -0.3786 -0.1845 -0.1996 0.0455 0.0529 0.1520 0.1831 -0.2538 -0.2892 -0.1530 0.0345 0.4826 -0.1960 -0.1411 0.3580 -0.1679 -0.1344 0.1491 0.0965 -0.2370 -0.2606 -0.1241 0.0990 0.0447 0.1041 0.1804 0.0863 0.0849 0.0770 0.0787 0.1053 0.0822 0.1478 0.1011 0.1090 0.1208 0.1158 0.1221 0.1208 0.0657 0.0852 0.0771 0.0914 0.0952 0.0905 0.0789 0.1132 0.1073 0.1141
va: 1.2290 2.0715 2.1139 2.1396 2.0131 2.0944 3.2014 3.1441 3.8563 3.8882 3.8129 4.2516 3.9334 3.9513 3.9164 3.6060 4.3183 4.0412 4.0110 4.1590 4.0894 4.0221 3.8615 3.9219 3.9399 3.9121 3.8884 1.0285 1.0326 1.0472 1.0428 1.0073 1.0181 1.0062 1.0051 1.0189 1.0056 1.0438 1.0092 1.0326 1.0209 1.0112 1.0143 1.0138 1.0217 1.0081 1.0080 1.0106 1.0135 1.0117 1.0139 1.0013 0.9949 0.9960
dispcorr: -0.031379304 hartree
energy: -1686.366684975337
dipole: 42.80689 -42.26921 0.53768 -0.79872 0.99839 0.19967 -1.87666 2.32347 0.44681
magnitude: 0.72706 au
magnitude: 1.84803 debye
