program: Orca
programVersion: 5.0.2
elementType: Cl O O O O O N N C C C C C C C C C C C C C C C C C C C H H H H H H H H H H H H H H H H H H H H H H H H H H H
charge: 0
multiplicity: 1
keywords: wb97x-d3
keywords: def2-TZVPP
keywords: def2/J RIJCOSX
keywords: DEFGRID2
keywords: scfconv7
keywords: smallprint printgap noloewdin
keywords: NOSOSCF
formula: C19H27ClN2O5
InChI: InChI=1/C19H27ClN2O5/c1-11(2)17(22-19(25)27-12(3)4)18(24)21-15(10-16(23)26-5)13-6-8-14(20)9-7-13/h6-9,11-12,15,17,21-22H,10H2,1-5H3
54 atoms
Cl -6.636011 -0.004399 -0.153381
O  1.29022 -2.907904 -0.152255
O  3.775853 1.286436 0.283951
O  -0.843915 1.432179 1.322212
O  1.818449 1.487561 -0.825265
O  0.984647 1.267016 2.594082
N  0.043414 -1.022399 -0.335661
N  3.034608 -0.42888 -0.886121
C  2.071149 -1.191312 -1.652832
C  2.752553 -2.233768 -2.53891
C  -0.823886 -1.319764 0.779076
C  1.093461 -1.820445 -0.652342
C  3.812731 -1.590397 -3.427179
C  1.713417 -2.954002 -3.392859
C  -0.258682 -0.718784 2.078454
C  -2.269408 -0.957726 0.510136
C  2.794167 0.845096 -0.492459
C  -2.689619 -0.297474 -0.636423
C  -3.236444 -1.332747 1.437918
C  0.0524 0.758448 2.032912
C  -4.02777 -0.000553 -0.845887
C  -4.576608 -1.046389 1.245832
C  3.681766 2.613373 0.833235
C  -4.966307 -0.372441 0.099719
C  4.184463 3.629921 -0.174521
C  4.495439 2.596439 2.110117
C  -0.66291 2.837749 1.197091
H  1.542418 -0.486351 -2.300269
H  3.231102 -2.975332 -1.890932
H  -0.784843 -2.403777 0.907114
H  0.084186 -0.06681 -0.661358
H  4.60794 -1.114133 -2.855119
H  3.375378 -0.829093 -4.076866
H  4.275039 -2.341472 -4.068458
H  1.179671 -2.251498 -4.037709
H  0.98056 -3.487757 -2.789819
H  2.194885 -3.687078 -4.040384
H  3.781112 -0.932661 -0.433997
H  -0.950333 -0.891668 2.908346
H  0.663999 -1.23872 2.33734
H  -1.978415 -0.010876 -1.3985
H  -2.948155 -1.872083 2.332857
H  -4.335895 0.516611 -1.744049
H  -5.312039 -1.34991 1.977819
H  2.639787 2.819758 1.08134
H  3.57054 3.640666 -1.074204
H  5.21768 3.424972 -0.458839
H  4.151476 4.629507 0.260245
H  4.101365 1.863496 2.812973
H  5.544655 2.36933 1.915228
H  4.448132 3.574478 2.588574
H  -1.528877 3.198394 0.648822
H  -0.620667 3.324472 2.171427
H  0.24335 3.065155 0.637802
totalener: -1686.33275518 hartree
nucrepener: 2825.62846502 hartree
electener: -4511.96122021 hartree
oneelecener: -7926.60245521 hartree
twoeener: 3414.64123500 hartree
kineticenergy: 1680.39895207 hartree
xcener: -138.347322104414 hartree
chargesum: 0.0000000
charge: -0.081198 -0.403658 -0.312793 -0.248955 -0.483704 -0.366674 -0.237405 -0.212897 0.027005 0.054589 0.166083 0.224016 -0.254629 -0.288784 -0.129017 0.122425 0.491833 -0.202733 -0.212775 0.313901 -0.117595 -0.139919 0.154249 0.085628 -0.257859 -0.231235 -0.138754 0.095884 0.051746 0.106079 0.165076 0.082491 0.077633 0.088498 0.077926 0.107340 0.084534 0.147088 0.093073 0.119325 0.104588 0.113229 0.118060 0.118807 0.049797 0.101403 0.084252 0.083369 0.103951 0.084266 0.074595 0.115756 0.116197 0.115891
qa: -0.0812 -0.4037 -0.3128 -0.2490 -0.4837 -0.3667 -0.2374 -0.2129 0.0270 0.0546 0.1661 0.2240 -0.2546 -0.2888 -0.1290 0.1224 0.4918 -0.2027 -0.2128 0.3139 -0.1176 -0.1399 0.1542 0.0856 -0.2579 -0.2312 -0.1388 0.0959 0.0517 0.1061 0.1651 0.0825 0.0776 0.0885 0.0779 0.1073 0.0845 0.1471 0.0931 0.1193 0.1046 0.1132 0.1181 0.1188 0.0498 0.1014 0.0843 0.0834 0.1040 0.0843 0.0746 0.1158 0.1162 0.1159
va: 1.2248 2.1094 2.1056 2.1063 2.0035 2.1259 3.1731 3.1407 3.8726 3.8680 3.8139 4.2522 3.9344 3.9545 3.8483 3.6596 4.3092 4.0306 4.0899 4.1716 4.0228 4.0341 3.8629 3.9255 3.9187 3.9344 3.8774 1.0315 1.0351 1.0326 1.0431 1.0180 1.0057 1.0076 1.0051 1.0150 1.0055 1.0416 1.0154 1.0271 1.0286 1.0089 1.0140 1.0134 1.0233 1.0162 1.0095 1.0085 1.0145 1.0085 1.0095 0.9970 0.9957 0.9941
dispcorr: -0.031723032 hartree
energy: -1686.364478217045
dipole: 44.35489 -43.76349 0.59140 6.33892 -5.69818 0.64073 -8.54060 8.38782 -0.15278
magnitude: 0.88523 au
magnitude: 2.25007 debye
