program: Orca
programVersion: 5.0.2
elementType: Cl O O O O O N N C C C C C C C C C C C C C C C C C C C H H H H H H H H H H H H H H H H H H H H H H H H H H H
charge: 0
multiplicity: 1
keywords: wb97x-d3
keywords: def2-TZVPP
keywords: def2/J RIJCOSX
keywords: DEFGRID2
keywords: scfconv7
keywords: smallprint printgap noloewdin
keywords: NOSOSCF
formula: C19H27ClN2O5
InChI: InChI=1/C19H27ClN2O5/c1-11(2)17(22-19(25)27-12(3)4)18(24)21-15(10-16(23)26-5)13-6-8-14(20)9-7-13/h6-9,11-12,15,17,21-22H,10H2,1-5H3
54 atoms
Cl -5.917829 1.625692 -0.040523
O  1.315826 -3.228178 -0.338476
O  3.023304 1.630014 -0.332208
O  -0.667512 0.269077 3.155161
O  1.204499 1.182232 -1.589564
O  1.009573 0.316803 1.684485
N  0.038908 -1.390314 -0.62678
N  2.801138 -0.388948 -1.188642
C  2.119997 -1.48904 -1.840352
C  3.116034 -2.477252 -2.460752
C  -0.928764 -1.722636 0.388352
C  1.132399 -2.146095 -0.860651
C  4.212277 -2.943778 -1.50552
C  3.731011 -1.874921 -3.720156
C  -0.358116 -1.647967 1.824883
C  -2.163462 -0.862811 0.252076
C  2.24894 0.841478 -1.068679
C  -2.094319 0.50441 -0.004853
C  -3.41697 -1.436291 0.42801
C  0.086179 -0.261728 2.196935
C  -3.244597 1.272141 -0.092901
C  -4.575576 -0.68128 0.349393
C  2.523494 2.92138 0.045052
C  -4.48115 0.674474 0.083853
C  2.862636 3.944737 -1.022827
C  3.151355 3.24186 1.386369
C  -0.368174 1.600306 3.548461
H  1.533045 -1.056815 -2.65577
H  2.533543 -3.356059 -2.750847
H  -1.221841 -2.766022 0.244674
H  -0.003842 -0.482977 -1.0684
H  4.796772 -3.73564 -1.974756
H  3.809367 -3.341213 -0.576916
H  4.918281 -2.14202 -1.273774
H  2.971372 -1.630932 -4.464558
H  4.430236 -2.572908 -4.182041
H  4.28043 -0.959378 -3.494704
H  3.538203 -0.618308 -0.541611
H  -1.119985 -2.006071 2.517172
H  0.497962 -2.321384 1.888836
H  -1.141969 1.000686 -0.152049
H  -3.497248 -2.498971 0.62333
H  -3.176748 2.329927 -0.305908
H  -5.542593 -1.145995 0.482328
H  1.439151 2.860808 0.161322
H  2.389545 3.700367 -1.972756
H  3.940952 4.009595 -1.175875
H  2.509181 4.931176 -0.720384
H  4.23894 3.292094 1.316858
H  2.796249 4.209889 1.74078
H  2.884695 2.489182 2.127227
H  -1.079256 1.84865 4.331257
H  0.646663 1.689646 3.937313
H  -0.487212 2.298164 2.718654
totalener: -1686.33319882 hartree
nucrepener: 2850.69116934 hartree
electener: -4537.02436816 hartree
oneelecener: -7977.06804666 hartree
twoeener: 3440.04367850 hartree
kineticenergy: 1680.38373670 hartree
xcener: -138.346265941549 hartree
chargesum: -0.0000000
charge: -0.077133 -0.423882 -0.312088 -0.250167 -0.481973 -0.391093 -0.215728 -0.228838 0.081689 0.052508 0.113369 0.239478 -0.317706 -0.269672 -0.113075 0.103041 0.499844 -0.229164 -0.176485 0.332709 -0.156052 -0.128773 0.164469 0.092018 -0.256138 -0.240927 -0.130097 0.107327 0.044125 0.090486 0.187352 0.087239 0.123875 0.062079 0.080346 0.086076 0.084162 0.151664 0.103221 0.122702 0.129653 0.113618 0.120444 0.120553 0.046271 0.103472 0.083021 0.080054 0.087331 0.075467 0.093774 0.126277 0.109046 0.100228
qa: -0.0771 -0.4239 -0.3121 -0.2502 -0.4820 -0.3911 -0.2157 -0.2288 0.0817 0.0525 0.1134 0.2395 -0.3177 -0.2697 -0.1131 0.1030 0.4998 -0.2292 -0.1765 0.3327 -0.1561 -0.1288 0.1645 0.0920 -0.2561 -0.2409 -0.1301 0.1073 0.0441 0.0905 0.1874 0.0872 0.1239 0.0621 0.0803 0.0861 0.0842 0.1517 0.1032 0.1227 0.1297 0.1136 0.1204 0.1206 0.0463 0.1035 0.0830 0.0801 0.0873 0.0755 0.0938 0.1263 0.1090 0.1002
va: 1.2287 2.0851 2.0952 2.1259 2.0128 2.1082 3.2388 3.1831 3.7926 3.8787 3.8984 4.2764 3.9355 3.9260 3.7747 3.5497 4.2912 4.0216 4.0457 4.1732 4.0819 4.0221 3.8651 3.9268 3.9327 3.9198 3.9007 1.0236 1.0274 1.0282 1.0384 1.0083 1.0172 1.0051 1.0084 1.0068 1.0114 1.0413 1.0304 1.0303 1.0263 1.0111 1.0137 1.0134 1.0219 1.0166 1.0090 1.0090 1.0118 1.0075 1.0179 0.9967 0.9934 0.9930
dispcorr: -0.032067046 hartree
energy: -1686.365265869620
dipole: 42.40799 -42.16810 0.23990 1.04740 -0.51834 0.52907 -3.86402 4.62301 0.75899
magnitude: 0.95579 au
magnitude: 2.42941 debye
