program: Orca
programVersion: 5.0.2
elementType: Cl O O O O O N N C C C C C C C C C C C C C C C C C C C H H H H H H H H H H H H H H H H H H H H H H H H H H H
charge: 0
multiplicity: 1
keywords: wb97x-d3
keywords: def2-TZVPP
keywords: def2/J RIJCOSX
keywords: DEFGRID2
keywords: scfconv7
keywords: smallprint printgap noloewdin
keywords: NOSOSCF
formula: C19H27ClN2O5
InChI: InChI=1/C19H27ClN2O5/c1-11(2)17(22-19(25)27-12(3)4)18(24)21-15(10-16(23)26-5)13-6-8-14(20)9-7-13/h6-9,11-12,15,17,21-22H,10H2,1-5H3
54 atoms
Cl -5.903988 1.681568 0.016501
O  1.285139 -3.239471 -0.39702
O  3.032969 1.61694 -0.298866
O  -0.687465 0.230546 3.126804
O  1.215397 1.196064 -1.567388
O  1.012497 0.26977 1.682819
N  0.02786 -1.384406 -0.660028
N  2.799822 -0.39027 -1.177502
C  2.122066 -1.47744 -1.853436
C  3.123246 -2.460623 -2.4738
C  -0.947667 -1.72596 0.344558
C  1.117599 -2.144833 -0.897858
C  4.200141 -2.950914 -1.508312
C  3.764863 -1.840166 -3.711026
C  -0.381226 -1.679137 1.784438
C  -2.174232 -0.852598 0.222618
C  2.254961 0.841799 -1.045637
C  -3.432628 -1.417118 0.392763
C  -2.092691 0.518634 -0.007552
C  0.07508 -0.302284 2.176778
C  -4.583827 -0.648671 0.338787
C  -3.235464 1.299997 -0.070441
C  2.539008 2.903669 0.100491
C  -4.4769 0.711802 0.104048
C  2.878314 3.943702 -0.950921
C  3.172734 3.1991 1.444755
C  -0.379964 1.556235 3.5320
H  1.54811 -1.031382 -2.670792
H  2.540942 -3.330583 -2.789704
H  -1.249272 -2.7641 0.181948
H  -0.002889 -0.468033 -1.083868
H  4.792102 -3.73325 -1.984217
H  3.779332 -3.36789 -0.596433
H  4.903557 -2.156435 -1.245538
H  4.459697 -2.538687 -4.178694
H  4.324937 -0.938392 -3.458042
H  3.019414 -1.568202 -4.460071
H  3.53197 -0.631875 -0.529507
H  -1.149307 -2.039298 2.468762
H  0.467973 -2.361685 1.841295
H  -3.522575 -2.482812 0.566278
H  -1.136204 1.008287 -0.150299
H  -5.554671 -1.106222 0.468708
H  -3.158051 2.361447 -0.260809
H  1.454733 2.84502 0.2195
H  2.402192 3.71644 -1.903534
H  3.95643 4.008131 -1.105571
H  2.528488 4.925948 -0.631028
H  4.260326 3.244884 1.372125
H  2.823964 4.16292 1.816492
H  2.905089 2.435546 2.174086
H  -1.104848 1.810588 4.300094
H  0.627259 1.630802 3.943317
H  -0.471698 2.259041 2.702815
totalener: -1686.33318294 hartree
nucrepener: 2852.35161103 hartree
electener: -4538.68479397 hartree
oneelecener: -7980.38147561 hartree
twoeener: 3441.69668164 hartree
kineticenergy: 1680.38260601 hartree
xcener: -138.346245075763 hartree
chargesum: -0.0000000
charge: -0.077237 -0.423515 -0.312078 -0.249652 -0.482074 -0.390728 -0.217320 -0.228538 0.081778 0.050894 0.114930 0.239746 -0.316824 -0.269302 -0.114301 0.103591 0.500018 -0.176927 -0.230455 0.331577 -0.128776 -0.154711 0.164629 0.092150 -0.255890 -0.241327 -0.130279 0.107347 0.044554 0.090647 0.187693 0.087369 0.123670 0.061673 0.086382 0.083919 0.080256 0.151881 0.103662 0.123278 0.113589 0.129036 0.120675 0.120288 0.045265 0.103503 0.083052 0.080005 0.087574 0.075572 0.094043 0.126533 0.109769 0.099384
qa: -0.0772 -0.4235 -0.3121 -0.2497 -0.4821 -0.3907 -0.2173 -0.2285 0.0818 0.0509 0.1149 0.2397 -0.3168 -0.2693 -0.1143 0.1036 0.5000 -0.1769 -0.2305 0.3316 -0.1288 -0.1547 0.1646 0.0921 -0.2559 -0.2413 -0.1303 0.1073 0.0446 0.0906 0.1877 0.0874 0.1237 0.0617 0.0864 0.0839 0.0803 0.1519 0.1037 0.1233 0.1136 0.1290 0.1207 0.1203 0.0453 0.1035 0.0831 0.0800 0.0876 0.0756 0.0940 0.1265 0.1098 0.0994
va: 1.2285 2.0854 2.0946 2.1260 2.0128 2.1084 3.2385 3.1832 3.7919 3.8814 3.9000 4.2760 3.9356 3.9262 3.7752 3.5504 4.2901 4.0457 4.0210 4.1741 4.0221 4.0806 3.8661 3.9269 3.9324 3.9196 3.9007 1.0234 1.0272 1.0281 1.0388 1.0081 1.0174 1.0053 1.0068 1.0115 1.0085 1.0416 1.0304 1.0302 1.0111 1.0267 1.0134 1.0138 1.0217 1.0168 1.0089 1.0090 1.0118 1.0075 1.0176 0.9967 0.9933 0.9931
dispcorr: -0.032154600 hartree
energy: -1686.365337541879
dipole: 42.48478 -42.23749 0.24729 0.80848 -0.28831 0.52017 -3.80940 4.57172 0.76232
magnitude: 0.95543 au
magnitude: 2.42852 debye
