program: Orca
programVersion: 5.0.2
elementType: Cl O O O O O N N C C C C C C C C C C C C C C C C C C C H H H H H H H H H H H H H H H H H H H H H H H H H H H
charge: 0
multiplicity: 1
keywords: wb97x-d3
keywords: def2-TZVPP
keywords: def2/J RIJCOSX
keywords: DEFGRID2
keywords: scfconv7
keywords: smallprint printgap noloewdin
keywords: NOSOSCF
formula: C19H27ClN2O5
InChI: InChI=1/C19H27ClN2O5/c1-11(2)17(22-19(25)27-12(3)4)18(24)21-15(10-16(23)26-5)13-6-8-14(20)9-7-13/h6-9,11-12,15,17,21-22H,10H2,1-5H3
54 atoms
Cl -6.406092 -1.605216 -1.032168
O  1.229506 -1.420832 -1.067014
O  4.966523 1.151545 -1.738329
O  -1.369124 -0.890315 4.541582
O  3.712898 2.681475 -0.645242
O  -1.07852 0.624767 2.933952
N  -0.015804 -0.365658 0.500114
N  2.839736 0.70673 -1.34024
C  1.519215 0.951038 -0.82611
C  0.650682 1.762398 -1.816896
C  -0.719969 -1.530153 0.990224
C  0.90654 -0.403344 -0.481575
C  -0.650864 2.255005 -1.193378
C  0.391047 1.019485 -3.12068
C  -0.524392 -1.681748 2.498101
C  -2.16895 -1.539165 0.534953
C  3.83273 1.610014 -1.192846
C  -2.433151 -1.434019 -0.829925
C  -3.24748 -1.685509 1.396799
C  -1.022029 -0.514726 3.316937
C  -3.725667 -1.454179 -1.319403
C  -4.552325 -1.705747 0.92243
C  6.143441 1.960288 -1.608699
C  -4.785912 -1.584694 -0.434105
C  7.064459 1.557457 -2.743187
C  6.780218 1.751987 -0.246155
C  -1.799108 0.134107 5.433351
H  1.614018 1.546558 0.087316
H  1.255675 2.645923 -2.041044
H  -0.232126 -2.391525 0.52791
H  -0.241709 0.512604 0.94085
H  -0.478818 2.764306 -0.242446
H  -1.36569 1.448753 -1.021658
H  -1.134501 2.973381 -1.855628
H  -0.093247 1.680116 -3.840649
H  -0.265967 0.159749 -2.977813
H  1.313157 0.6604 -3.576998
H  3.021822 -0.188626 -1.765856
H  -0.973128 -2.611115 2.851346
H  0.548813 -1.775937 2.691414
H  -1.611346 -1.349524 -1.530207
H  -3.103969 -1.796873 2.463434
H  -3.908874 -1.374605 -2.381896
H  -5.379156 -1.815699 1.61016
H  5.867704 3.011929 -1.719919
H  7.353022 0.508094 -2.669496
H  7.974249 2.156965 -2.712447
H  6.593691 1.715092 -3.713354
H  6.113197 2.062114 0.556719
H  7.048047 0.704964 -0.095411
H  7.691644 2.345357 -0.165356
H  -1.01473 0.871608 5.60294
H  -2.684852 0.645503 5.056851
H  -2.03608 -0.365517 6.368218
totalener: -1686.33483899 hartree
nucrepener: 2695.93003178 hartree
electener: -4382.26487077 hartree
oneelecener: -7667.11242856 hartree
twoeener: 3284.84755779 hartree
kineticenergy: 1680.39547090 hartree
xcener: -138.350471293608 hartree
chargesum: -0.0000000
charge: -0.076676 -0.428064 -0.321647 -0.266423 -0.443805 -0.388067 -0.208580 -0.256885 0.066303 0.085443 0.198329 0.229039 -0.327998 -0.286405 -0.173518 -0.016043 0.457855 -0.237335 -0.129228 0.350614 -0.135131 -0.146077 0.145707 0.106895 -0.230664 -0.258184 -0.130932 0.104910 0.057276 0.113334 0.182345 0.100737 0.085091 0.095373 0.091663 0.075781 0.091875 0.162373 0.109802 0.112211 0.168271 0.109606 0.121340 0.116006 0.061633 0.082067 0.075791 0.090346 0.101569 0.080593 0.080424 0.115157 0.113175 0.122726
qa: -0.0767 -0.4281 -0.3216 -0.2664 -0.4438 -0.3881 -0.2086 -0.2569 0.0663 0.0854 0.1983 0.2290 -0.3280 -0.2864 -0.1735 -0.0160 0.4579 -0.2373 -0.1292 0.3506 -0.1351 -0.1461 0.1457 0.1069 -0.2307 -0.2582 -0.1309 0.1049 0.0573 0.1133 0.1823 0.1007 0.0851 0.0954 0.0917 0.0758 0.0919 0.1624 0.1098 0.1122 0.1683 0.1096 0.1213 0.1160 0.0616 0.0821 0.0758 0.0903 0.1016 0.0806 0.0804 0.1152 0.1132 0.1227
va: 1.2288 2.0645 2.0917 2.1332 2.0640 2.0855 3.1797 3.1914 3.9029 3.7382 3.7531 4.2512 3.9658 3.9546 3.9232 3.8830 4.3561 4.0056 3.9545 4.1027 4.0416 4.0895 3.8753 3.9220 3.9304 3.9019 3.8877 1.0419 1.0254 1.0365 1.0267 1.0035 1.0006 1.0101 1.0019 1.0062 1.0179 1.0527 1.0182 1.0137 0.9940 1.0239 1.0154 1.0171 1.0245 1.0090 1.0080 1.0111 1.0192 1.0090 1.0098 0.9957 0.9945 0.9927
dispcorr: -0.028807595 hartree
energy: -1686.363646587745
dipole: 39.59884 -39.67181 -0.07297 16.58251 -16.93582 -0.35331 -2.12258 3.47318 1.35060
magnitude: 1.39795 au
magnitude: 3.55332 debye
