program: Orca
programVersion: 5.0.2
elementType: Cl O O O O O N N C C C C C C C C C C C C C C C C C C C H H H H H H H H H H H H H H H H H H H H H H H H H H H
charge: 0
multiplicity: 1
keywords: wb97x-d3
keywords: def2-TZVPP
keywords: def2/J RIJCOSX
keywords: DEFGRID2
keywords: scfconv7
keywords: smallprint printgap noloewdin
keywords: NOSOSCF
formula: C19H27ClN2O5
InChI: InChI=1/C19H27ClN2O5/c1-11(2)17(22-19(25)27-12(3)4)18(24)21-15(10-16(23)26-5)13-6-8-14(20)9-7-13/h6-9,11-12,15,17,21-22H,10H2,1-5H3
54 atoms
Cl -6.455251 -1.596395 -0.96622
O  1.286834 -1.424891 -1.02115
O  4.989624 1.15589 -1.716011
O  -1.340496 -0.939559 4.526549
O  3.707141 2.728478 -0.720513
O  -1.111952 0.594821 2.9264
N  -0.036651 -0.3553 0.468851
N  2.86386 0.709094 -1.319659
C  1.53668 0.955705 -0.823633
C  0.677668 1.751532 -1.835504
C  -0.734393 -1.523509 0.959005
C  0.927109 -0.399576 -0.472966
C  -0.62865 2.259158 -1.234651
C  0.43114 0.985136 -3.128082
C  -0.51477 -1.694248 2.461519
C  -2.19107 -1.525297 0.528423
C  3.844907 1.630265 -1.207987
C  -2.483769 -1.34771 -0.82275
C  -3.25065 -1.743351 1.399123
C  -1.023278 -0.545837 3.299345
C  -3.784376 -1.36931 -1.290379
C  -4.563395 -1.765313 0.947255
C  6.155234 1.986218 -1.627406
C  -4.825094 -1.573676 -0.396126
C  7.097282 1.51491 -2.717627
C  6.775527 1.881957 -0.24533
C  -1.788095 0.065862 5.431099
H  1.615195 1.560876 0.08568
H  1.285762 2.630131 -2.069083
H  -0.255836 -2.379916 0.478117
H  -0.276277 0.523956 0.899996
H  -1.102592 2.966435 -1.915574
H  -0.464744 2.786266 -0.29199
H  -1.348763 1.459498 -1.055212
H  -0.04742 1.631647 -3.864449
H  -0.225634 0.126397 -2.976697
H  1.358177 0.619201 -3.568564
H  3.061269 -0.20482 -1.696546
H  -0.942583 -2.635682 2.808945
H  0.562399 -1.774101 2.638166
H  -1.678296 -1.199815 -1.531268
H  -3.084773 -1.909061 2.455481
H  -3.988707 -1.232529 -2.343177
H  -5.37474 -1.931594 1.642123
H  5.86922 3.023994 -1.816574
H  7.400521 0.478708 -2.56184
H  7.99752 2.129376 -2.720135
H  6.637674 1.592186 -3.702757
H  6.094363 2.23823 0.525738
H  7.054151 0.851457 -0.019019
H  7.678862 2.490822 -0.194588
H  -2.694443 0.551863 5.070283
H  -1.996415 -0.446409 6.36596
H  -1.024488 0.826185 5.594274
totalener: -1686.33491377 hartree
nucrepener: 2693.54634880 hartree
electener: -4379.88126257 hartree
oneelecener: -7662.31866560 hartree
twoeener: 3282.43740303 hartree
kineticenergy: 1680.39047945 hartree
xcener: -138.349794567261 hartree
chargesum: 0.0000000
charge: -0.076512 -0.427093 -0.321480 -0.266385 -0.443914 -0.388154 -0.211873 -0.256239 0.070940 0.078116 0.184255 0.228943 -0.326893 -0.288521 -0.166539 -0.011242 0.457945 -0.228406 -0.130354 0.349559 -0.141756 -0.145851 0.147641 0.109554 -0.231323 -0.258517 -0.130608 0.105276 0.058779 0.113305 0.181457 0.095602 0.101201 0.083991 0.091967 0.077428 0.093714 0.162835 0.108674 0.112248 0.170890 0.108653 0.120599 0.116164 0.060620 0.081872 0.076104 0.090404 0.101943 0.080289 0.080331 0.113099 0.122372 0.114888
qa: -0.0765 -0.4271 -0.3215 -0.2664 -0.4439 -0.3882 -0.2119 -0.2562 0.0709 0.0781 0.1843 0.2289 -0.3269 -0.2885 -0.1665 -0.0112 0.4579 -0.2284 -0.1304 0.3496 -0.1418 -0.1459 0.1476 0.1096 -0.2313 -0.2585 -0.1306 0.1053 0.0588 0.1133 0.1815 0.0956 0.1012 0.0840 0.0920 0.0774 0.0937 0.1628 0.1087 0.1122 0.1709 0.1087 0.1206 0.1162 0.0606 0.0819 0.0761 0.0904 0.1019 0.0803 0.0803 0.1131 0.1224 0.1149
va: 1.2288 2.0669 2.0916 2.1332 2.0641 2.0854 3.1780 3.1911 3.9026 3.7334 3.7615 4.2469 3.9619 3.9516 3.9202 3.8879 4.3556 4.0045 3.9570 4.1024 4.0524 4.0887 3.8749 3.9198 3.9310 3.9007 3.8879 1.0390 1.0272 1.0385 1.0258 1.0103 1.0033 1.0018 1.0016 1.0068 1.0179 1.0538 1.0180 1.0142 0.9843 1.0238 1.0160 1.0170 1.0241 1.0089 1.0080 1.0110 1.0197 1.0089 1.0098 0.9946 0.9928 0.9956
dispcorr: -0.028779901 hartree
energy: -1686.363693672948
dipole: 39.91047 -39.98419 -0.07373 16.54321 -16.91445 -0.37123 -2.45802 3.78689 1.32887
magnitude: 1.38172 au
magnitude: 3.51205 debye
