program: Orca
programVersion: 5.0.2
elementType: Cl O O O O O N N C C C C C C C C C C C C C C C C C C C H H H H H H H H H H H H H H H H H H H H H H H H H H H
charge: 0
multiplicity: 1
keywords: wb97x-d3
keywords: def2-TZVPP
keywords: def2/J RIJCOSX
keywords: DEFGRID2
keywords: scfconv7
keywords: smallprint printgap noloewdin
keywords: NOSOSCF
formula: C19H27ClN2O5
InChI: InChI=1/C19H27ClN2O5/c1-11(2)17(22-19(25)27-12(3)4)18(24)21-15(10-16(23)26-5)13-6-8-14(20)9-7-13/h6-9,11-12,15,17,21-22H,10H2,1-5H3
54 atoms
Cl -6.628117 0.567447 -0.956816
O  1.259311 -2.464475 0.48728
O  3.17166 1.975384 -0.26644
O  0.687016 -1.161106 3.319166
O  1.262121 1.527717 -1.377675
O  1.77229 0.364923 2.097971
N  -0.116206 -0.858937 -0.32865
N  2.797928 -0.093777 -0.929079
C  2.004845 -1.196825 -1.434629
C  2.894536 -2.357046 -1.881085
C  -1.041118 -0.848881 0.781938
C  1.013979 -1.601255 -0.332374
C  3.941045 -1.890027 -2.888112
C  2.047935 -3.475513 -2.481415
C  -0.610548 0.150598 1.87805
C  -2.434148 -0.506737 0.311835
C  2.31576 1.172824 -0.885918
C  -2.685535 0.662312 -0.400919
C  -3.504749 -1.335117 0.619626
C  0.751398 -0.178551 2.430295
C  -3.969048 0.994896 -0.799209
C  -4.797389 -1.013971 0.234376
C  2.750633 3.310792 0.049401
C  -5.021879 0.153113 -0.474724
C  3.061709 4.243295 -1.106457
C  3.474102 3.689241 1.326141
C  1.922114 -1.69556 3.776848
H  1.456312 -0.830441 -2.307316
H  3.403746 -2.756206 -0.997541
H  -1.047283 -1.852813 1.20885
H  -0.126489 -0.060683 -0.948982
H  4.603842 -1.127523 -2.4823
H  3.469915 -1.473287 -3.780987
H  4.559967 -2.72938 -3.20678
H  2.683784 -4.299177 -2.806832
H  1.498431 -3.12398 -3.357856
H  1.331795 -3.881335 -1.76928
H  3.520557 -0.321487 -0.26346
H  -0.581633 1.158214 1.461625
H  -1.35632 0.132588 2.674861
H  -1.877162 1.339939 -0.654313
H  -3.332783 -2.251264 1.171051
H  -4.150241 1.904323 -1.354893
H  -5.621202 -1.668857 0.481622
H  1.673344 3.307737 0.232719
H  2.522377 3.954241 -2.007298
H  4.13027 4.252227 -1.326432
H  2.764949 5.261967 -0.853884
H  3.231628 2.993556 2.128416
H  4.555915 3.692646 1.184715
H  3.175931 4.689767 1.640338
H  2.492862 -2.113332 2.948363
H  2.523725 -0.943917 4.288199
H  1.664515 -2.488371 4.473784
totalener: -1686.33562256 hartree
nucrepener: 2813.85893246 hartree
electener: -4500.19455502 hartree
oneelecener: -7903.50577236 hartree
twoeener: 3403.31121735 hartree
kineticenergy: 1680.39296679 hartree
xcener: -138.344825165662 hartree
chargesum: -0.0000000
charge: -0.076285 -0.421409 -0.302783 -0.253702 -0.483917 -0.384991 -0.179855 -0.200420 0.056482 0.049813 0.147736 0.175529 -0.252964 -0.288402 -0.135743 0.024445 0.484969 -0.193290 -0.143119 0.359881 -0.163950 -0.134225 0.146919 0.096427 -0.254577 -0.228514 -0.123828 0.096085 0.044090 0.103904 0.177260 0.086109 0.076223 0.086224 0.082461 0.079313 0.104991 0.146529 0.098775 0.108648 0.122857 0.115832 0.122216 0.120836 0.052530 0.101706 0.082011 0.080405 0.101323 0.079238 0.074694 0.113163 0.107601 0.114751
qa: -0.0763 -0.4214 -0.3028 -0.2537 -0.4839 -0.3850 -0.1799 -0.2004 0.0565 0.0498 0.1477 0.1755 -0.2530 -0.2884 -0.1357 0.0244 0.4850 -0.1933 -0.1431 0.3599 -0.1640 -0.1342 0.1469 0.0964 -0.2546 -0.2285 -0.1238 0.0961 0.0441 0.1039 0.1773 0.0861 0.0762 0.0862 0.0825 0.0793 0.1050 0.1465 0.0988 0.1086 0.1229 0.1158 0.1222 0.1208 0.0525 0.1017 0.0820 0.0804 0.1013 0.0792 0.0747 0.1132 0.1076 0.1148
va: 1.2290 2.0735 2.1091 2.1366 2.0049 2.0857 3.2020 3.1427 3.8594 3.8883 3.8306 4.2537 3.9329 3.9518 3.8860 3.6227 4.3191 4.0368 4.0129 4.1597 4.0799 4.0231 3.8752 3.9235 3.9226 3.9259 3.8873 1.0277 1.0341 1.0484 1.0431 1.0187 1.0062 1.0071 1.0054 1.0053 1.0178 1.0438 1.0202 1.0294 1.0208 1.0112 1.0143 1.0138 1.0233 1.0173 1.0090 1.0095 1.0150 1.0102 1.0083 1.0013 0.9950 0.9962
dispcorr: -0.030920830 hartree
energy: -1686.366543384904
dipole: 44.15413 -43.67930 0.47483 0.51370 -0.38753 0.12617 -2.44317 2.93695 0.49378
magnitude: 0.69656 au
magnitude: 1.77052 debye
