program: Orca
programVersion: 5.0.2
elementType: Cl O O O O O N N C C C C C C C C C C C C C C C C C C C H H H H H H H H H H H H H H H H H H H H H H H H H H H
charge: 0
multiplicity: 1
keywords: wb97x-d3
keywords: def2-TZVPP
keywords: def2/J RIJCOSX
keywords: DEFGRID2
keywords: scfconv7
keywords: smallprint printgap noloewdin
keywords: NOSOSCF
formula: C19H27ClN2O5
InChI: InChI=1/C19H27ClN2O5/c1-11(2)17(22-19(25)27-12(3)4)18(24)21-15(10-16(23)26-5)13-6-8-14(20)9-7-13/h6-9,11-12,15,17,21-22H,10H2,1-5H3
54 atoms
Cl -6.576746 0.528907 -0.954036
O  1.18665 -2.44804 0.367273
O  3.254148 2.057204 -0.404219
O  0.822304 -1.338898 3.323594
O  1.296863 1.668016 -1.45362
O  1.951352 0.183885 2.137344
N  -0.123171 -0.705505 -0.243007
N  2.753523 -0.013589 -0.981063
C  1.916983 -1.080688 -1.490001
C  2.761811 -2.240958 -2.018909
C  -0.990225 -0.7418 0.916418
C  0.960002 -1.507423 -0.368118
C  3.779457 -1.750286 -3.043988
C  1.869784 -3.313649 -2.63639
C  -0.450055 0.152542 2.044379
C  -2.397577 -0.385287 0.485898
C  2.340118 1.276623 -0.972403
C  -3.06437 -1.253531 -0.376416
C  -3.051739 0.771351 0.886021
C  0.913548 -0.30766 2.493651
C  -4.34491 -0.983759 -0.821548
C  -4.337208 1.05936 0.447733
C  2.937976 3.444276 -0.212964
C  -4.977061 0.179339 -0.404535
C  4.26459 4.168309 -0.105907
C  2.078138 3.621512 1.024924
C  2.037693 -1.980565 3.6867
H  1.340281 -0.668466 -2.322924
H  3.295074 -2.68924 -1.174153
H  -0.998974 -1.772524 1.278152
H  -0.150192 0.132826 -0.808722
H  4.361908 -2.587779 -3.429561
H  4.478761 -1.026786 -2.628167
H  3.284156 -1.276257 -3.8945
H  1.170635 -3.736341 -1.917404
H  2.474904 -4.135191 -3.020784
H  1.298605 -2.911297 -3.476533
H  3.482974 -0.265535 -0.332476
H  -0.361403 1.182518 1.695643
H  -1.144849 0.127394 2.886471
H  -2.569945 -2.158592 -0.707665
H  -2.572487 1.476548 1.55141
H  -4.850387 -1.66942 -1.487248
H  -4.83245 1.965081 0.768766
H  2.39588 3.809791 -1.088347
H  4.871236 4.01973 -0.998898
H  4.835968 3.827706 0.758293
H  4.093038 5.238711 0.006837
H  1.114972 3.126515 0.912881
H  2.572587 3.21459 1.906686
H  1.887907 4.68168 1.195536
H  2.712197 -1.30162 4.208553
H  1.758497 -2.79457 4.349781
H  2.540053 -2.383959 2.808355
totalener: -1686.33422978 hartree
nucrepener: 2813.55594417 hartree
electener: -4499.89017394 hartree
oneelecener: -7902.87344470 hartree
twoeener: 3402.98327075 hartree
kineticenergy: 1680.39664163 hartree
xcener: -138.346625445574 hartree
chargesum: -0.0000000
charge: -0.076519 -0.419509 -0.303911 -0.254379 -0.467925 -0.375712 -0.177644 -0.203854 0.042307 0.061339 0.159473 0.185818 -0.255871 -0.290025 -0.130057 -0.027821 0.478295 -0.177340 -0.134254 0.340064 -0.147137 -0.156404 0.148705 0.108016 -0.235801 -0.267566 -0.126047 0.099263 0.043376 0.118834 0.176234 0.086507 0.085610 0.076920 0.103212 0.082786 0.078937 0.147892 0.086352 0.113326 0.120017 0.117388 0.121605 0.119046 0.066432 0.091069 0.084501 0.076729 0.087825 0.093973 0.089585 0.107478 0.115266 0.113598
qa: -0.0765 -0.4195 -0.3039 -0.2544 -0.4679 -0.3757 -0.1776 -0.2039 0.0423 0.0613 0.1595 0.1858 -0.2559 -0.2900 -0.1301 -0.0278 0.4783 -0.1773 -0.1343 0.3401 -0.1471 -0.1564 0.1487 0.1080 -0.2358 -0.2676 -0.1260 0.0993 0.0434 0.1188 0.1762 0.0865 0.0856 0.0769 0.1032 0.0828 0.0789 0.1479 0.0864 0.1133 0.1200 0.1174 0.1216 0.1190 0.0664 0.0911 0.0845 0.0767 0.0878 0.0940 0.0896 0.1075 0.1153 0.1136
va: 1.2293 2.0722 2.1111 2.1395 2.0282 2.1007 3.1449 3.1384 3.8670 3.8759 3.7259 4.2504 3.9355 3.9502 3.9348 3.7151 4.3229 4.0501 3.9649 4.2031 4.0312 4.0867 3.8663 3.9178 3.9374 3.9094 3.8894 1.0308 1.0329 1.0308 1.0417 1.0069 1.0186 1.0061 1.0191 1.0060 1.0048 1.0441 1.0139 1.0264 1.0156 1.0109 1.0133 1.0157 1.0223 1.0107 1.0083 1.0080 1.0148 1.0121 1.0111 0.9950 0.9961 1.0004
dispcorr: -0.030971488 hartree
energy: -1686.365201265657
dipole: 42.98234 -42.40910 0.57324 0.52916 -0.35263 0.17653 -1.68465 2.19746 0.51281
magnitude: 0.78914 au
magnitude: 2.00584 debye
