program: Orca
programVersion: 5.0.2
elementType: Cl O O O O O N N C C C C C C C C C C C C C C C C C C C H H H H H H H H H H H H H H H H H H H H H H H H H H H
charge: 0
multiplicity: 1
keywords: wb97x-d3
keywords: def2-TZVPP
keywords: def2/J RIJCOSX
keywords: DEFGRID2
keywords: scfconv7
keywords: smallprint printgap noloewdin
keywords: NOSOSCF
formula: C19H27ClN2O5
InChI: InChI=1/C19H27ClN2O5/c1-11(2)17(22-19(25)27-12(3)4)18(24)21-15(10-16(23)26-5)13-6-8-14(20)9-7-13/h6-9,11-12,15,17,21-22H,10H2,1-5H3
54 atoms
Cl -6.277717 -0.139465 0.086467
O  0.450019 -0.492087 -1.698302
O  4.224935 1.715841 -2.854264
O  -1.699274 -3.000282 3.512382
O  4.458361 1.909708 -0.61362
O  -0.115369 -1.441028 3.335335
N  0.439999 -0.943983 0.506106
N  2.554379 1.10428 -1.548832
C  1.881319 0.844761 -0.305409
C  1.244024 2.130551 0.276887
C  -0.550295 -1.988029 0.388802
C  0.857261 -0.25563 -0.57829
C  0.877097 2.004366 1.750806
C  0.065335 2.620878 -0.554605
C  -0.411281 -2.999968 1.537877
C  -1.972101 -1.473286 0.291039
C  3.806854 1.606188 -1.586559
C  -2.417366 -0.388864 1.037619
C  -2.881892 -2.126639 -0.530447
C  -0.711033 -2.38797 2.883646
C  -3.737916 0.026581 0.977927
C  -4.206066 -1.726202 -0.601761
C  5.537565 2.241877 -3.087246
C  -4.628482 -0.64967 0.160697
C  5.524953 3.758778 -3.022647
C  5.96131 1.72863 -4.449287
C  -2.094608 -2.466226 4.77217
H  2.61552 0.479083 0.421126
H  2.042132 2.875429 0.217585
H  -0.335312 -2.534647 -0.532595
H  0.78478 -0.70951 1.423895
H  1.708218 1.619649 2.34512
H  0.016151 1.357232 1.917383
H  0.617672 2.982195 2.157228
H  -0.261541 3.602033 -0.208218
H  -0.793008 1.94931 -0.48567
H  0.327004 2.717473 -1.608211
H  2.09818 0.804142 -2.39661
H  -1.075209 -3.841456 1.34605
H  0.613534 -3.381452 1.553732
H  -1.732512 0.15427 1.674844
H  -2.552553 -2.959841 -1.140028
H  -4.07005 0.874868 1.560193
H  -4.900216 -2.2404 -1.251814
H  6.218377 1.855404 -2.324387
H  6.520929 4.1482 -3.236902
H  5.237668 4.11388 -2.034401
H  4.837431 4.176157 -3.760007
H  5.301733 2.097301 -5.23606
H  6.972641 2.066366 -4.675353
H  5.957191 0.639313 -4.482799
H  -2.453404 -1.442157 4.670661
H  -2.903144 -3.100395 5.123199
H  -1.276025 -2.483102 5.491191
totalener: -1686.33480860 hartree
nucrepener: 2719.73147942 hartree
electener: -4406.06628802 hartree
oneelecener: -7714.83148259 hartree
twoeener: 3308.76519457 hartree
kineticenergy: 1680.39684810 hartree
xcener: -138.348552329611 hartree
chargesum: -0.0000000
charge: -0.077397 -0.418084 -0.320578 -0.247504 -0.444796 -0.390832 -0.228483 -0.249659 0.066109 0.059602 0.094934 0.244921 -0.317550 -0.276158 -0.113656 0.163966 0.457710 -0.302794 -0.191484 0.347042 -0.133066 -0.118273 0.146017 0.087148 -0.259262 -0.232222 -0.122834 0.107561 0.056820 0.101239 0.173276 0.106569 0.064653 0.094928 0.088242 0.083340 0.096790 0.162949 0.096232 0.111076 0.163625 0.110226 0.121236 0.119980 0.060887 0.080279 0.102654 0.080145 0.081531 0.076270 0.090638 0.109461 0.122794 0.113782
qa: -0.0774 -0.4181 -0.3206 -0.2475 -0.4448 -0.3908 -0.2285 -0.2497 0.0661 0.0596 0.0949 0.2449 -0.3175 -0.2762 -0.1137 0.1640 0.4577 -0.3028 -0.1915 0.3470 -0.1331 -0.1183 0.1460 0.0871 -0.2593 -0.2322 -0.1228 0.1076 0.0568 0.1012 0.1733 0.1066 0.0647 0.0949 0.0882 0.0833 0.0968 0.1629 0.0962 0.1111 0.1636 0.1102 0.1212 0.1200 0.0609 0.0803 0.1027 0.0801 0.0815 0.0763 0.0906 0.1095 0.1228 0.1138
va: 1.2285 2.0825 2.0917 2.1472 2.0634 2.0902 3.1957 3.1913 3.9144 3.7402 3.9400 4.2363 3.9502 3.9404 3.8729 3.4598 4.3551 4.0303 4.0945 4.1600 4.0703 4.0080 3.8783 3.9368 3.9014 3.9320 3.8830 1.0348 1.0299 1.0254 1.0374 1.0043 1.0068 1.0090 1.0010 1.0051 1.0183 1.0565 1.0289 1.0133 0.9820 1.0107 1.0147 1.0130 1.0234 1.0095 1.0197 1.0091 1.0092 1.0081 1.0108 0.9954 0.9938 0.9954
dispcorr: -0.029849656 hartree
energy: -1686.364658256749
dipole: 36.72603 -37.07331 -0.34728 15.11089 -16.14576 -1.03488 -3.60618 4.45664 0.85045
magnitude: 1.38378 au
magnitude: 3.51729 debye
