program: Orca
programVersion: 5.0.2
elementType: Cl O O O O O N N C C C C C C C C C C C C C C C C C C C H H H H H H H H H H H H H H H H H H H H H H H H H H H
charge: 0
multiplicity: 1
keywords: wb97x-d3
keywords: def2-TZVPP
keywords: def2/J RIJCOSX
keywords: DEFGRID2
keywords: scfconv7
keywords: smallprint printgap noloewdin
keywords: NOSOSCF
formula: C19H27ClN2O5
InChI: InChI=1/C19H27ClN2O5/c1-11(2)17(22-19(25)27-12(3)4)18(24)21-15(10-16(23)26-5)13-6-8-14(20)9-7-13/h6-9,11-12,15,17,21-22H,10H2,1-5H3
54 atoms
Cl -6.220426 -0.395385 -0.410925
O  0.54172 -0.562883 -1.603302
O  4.252852 1.734521 -2.7902
O  -1.757374 -2.642674 3.719011
O  4.323375 2.213273 -0.58223
O  -0.219818 -1.048354 3.460262
N  0.454211 -0.804215 0.630562
N  2.543356 1.162434 -1.517826
C  1.809038 0.999927 -0.29281
C  1.050734 2.292411 0.098057
C  -0.471054 -1.910451 0.562145
C  0.877006 -0.191832 -0.495909
C  0.58522 2.294755 1.548975
C  -0.096166 2.607888 -0.853653
C  -0.369529 -2.789489 1.818802
C  -1.901712 -1.486177 0.303231
C  3.760509 1.744551 -1.544845
C  -2.473237 -0.390911 0.940648
C  -2.689836 -2.229834 -0.565084
C  -0.76019 -2.057522 3.078488
C  -3.799169 -0.05115 0.726387
C  -4.017743 -1.906105 -0.789878
C  5.570045 2.260842 -2.994822
C  -4.567041 -0.815326 -0.1370
C  5.64598 2.654091 -4.456826
C  6.616858 1.22652 -2.620607
C  -2.226073 -2.009122 4.905334
H  2.516407 0.771858 0.512277
H  1.802795 3.080849 0.008425
H  -0.161668 -2.539451 -0.276134
H  0.731526 -0.461263 1.537077
H  -0.237855 1.602694 1.726631
H  0.226749 3.286475 1.825846
H  1.394275 2.041534 2.237062
H  0.228085 2.603378 -1.894127
H  -0.500911 3.598437 -0.642649
H  -0.916335 1.893443 -0.757114
H  2.157758 0.744526 -2.350633
H  -0.994805 -3.669976 1.679356
H  0.663882 -3.130027 1.92997
H  -1.88413 0.22194 1.610237
H  -2.25883 -3.072379 -1.092643
H  -4.229879 0.806572 1.22418
H  -4.616184 -2.489251 -1.475819
H  5.701471 3.148418 -2.370636
H  6.621968 3.087975 -4.674407
H  4.88716 3.394434 -4.709458
H  5.511173 1.789904 -5.108751
H  6.496816 0.316929 -3.21133
H  7.615779 1.620073 -2.812448
H  6.56206 0.967897 -1.564387
H  -3.026734 -2.638874 5.281818
H  -1.439552 -1.927692 5.655314
H  -2.61535 -1.013253 4.69377
totalener: -1686.33489569 hartree
nucrepener: 2721.76389529 hartree
electener: -4408.09879099 hartree
oneelecener: -7718.92432709 hartree
twoeener: 3310.82553610 hartree
kineticenergy: 1680.40582007 hartree
xcener: -138.350154616868 hartree
chargesum: -0.0000000
charge: -0.077701 -0.418771 -0.321143 -0.246705 -0.445357 -0.391020 -0.226033 -0.249466 0.068229 0.063163 0.097995 0.243034 -0.317720 -0.277267 -0.111683 0.175068 0.456168 -0.319523 -0.191230 0.344806 -0.122478 -0.112042 0.146920 0.080787 -0.231161 -0.258470 -0.123512 0.106078 0.058539 0.100729 0.172798 0.065384 0.094769 0.105220 0.095872 0.088550 0.083673 0.162897 0.096808 0.111777 0.156046 0.108929 0.120582 0.118955 0.060702 0.075859 0.090475 0.081546 0.080075 0.079971 0.102351 0.123103 0.113704 0.109723
qa: -0.0777 -0.4188 -0.3211 -0.2467 -0.4454 -0.3910 -0.2260 -0.2495 0.0682 0.0632 0.0980 0.2430 -0.3177 -0.2773 -0.1117 0.1751 0.4562 -0.3195 -0.1912 0.3448 -0.1225 -0.1120 0.1469 0.0808 -0.2312 -0.2585 -0.1235 0.1061 0.0585 0.1007 0.1728 0.0654 0.0948 0.1052 0.0959 0.0885 0.0837 0.1629 0.0968 0.1118 0.1560 0.1089 0.1206 0.1190 0.0607 0.0759 0.0905 0.0815 0.0801 0.0800 0.1024 0.1231 0.1137 0.1097
va: 1.2283 2.0809 2.0917 2.1474 2.0631 2.0896 3.1965 3.1931 3.9177 3.7342 3.9380 4.2328 3.9533 3.9446 3.8752 3.4392 4.3582 4.0403 4.1008 4.1589 4.0580 4.0022 3.8758 3.9406 3.9314 3.9010 3.8840 1.0354 1.0309 1.0246 1.0385 1.0051 1.0092 1.0046 1.0179 1.0011 1.0042 1.0565 1.0288 1.0121 0.9907 1.0118 1.0143 1.0133 1.0241 1.0080 1.0109 1.0091 1.0093 1.0098 1.0195 0.9937 0.9955 0.9950
dispcorr: -0.029822567 hartree
energy: -1686.364718261068
dipole: 37.03506 -37.36034 -0.32529 13.50432 -14.52948 -1.02515 -2.00975 2.97243 0.96268
magnitude: 1.44344 au
magnitude: 3.66892 debye
