program: Orca
programVersion: 5.0.2
elementType: Cl O O O O O N N C C C C C C C C C C C C C C C C C C C H H H H H H H H H H H H H H H H H H H H H H H H H H H
charge: 0
multiplicity: 1
keywords: wb97x-d3
keywords: def2-TZVPP
keywords: def2/J RIJCOSX
keywords: DEFGRID2
keywords: scfconv7
keywords: smallprint printgap noloewdin
keywords: NOSOSCF
formula: C19H27ClN2O5
InChI: InChI=1/C19H27ClN2O5/c1-11(2)17(22-19(25)27-12(3)4)18(24)21-15(10-16(23)26-5)13-6-8-14(20)9-7-13/h6-9,11-12,15,17,21-22H,10H2,1-5H3
54 atoms
Cl -6.673253 0.655571 -1.011939
O  1.210827 -2.419977 0.513173
O  3.310696 1.806534 -0.041545
O  1.634396 0.159695 2.213343
O  1.397062 1.575724 -1.21321
O  0.452524 -1.177108 3.562597
N  -0.18586 -0.839694 -0.314055
N  2.81684 -0.172065 -0.89207
C  1.931643 -1.186221 -1.430437
C  2.72101 -2.386281 -1.953841
C  -1.126796 -0.84653 0.784474
C  0.948958 -1.57186 -0.315927
C  3.747138 -1.953657 -2.996432
C  1.774012 -3.426346 -2.543871
C  -0.706884 0.116839 1.915124
C  -2.507941 -0.48068 0.296557
C  2.4161 1.114258 -0.74545
C  -2.740675 0.711369 -0.383305
C  -3.588508 -1.311664 0.560381
C  0.501742 -0.384469 2.665592
C  -4.015332 1.063333 -0.794076
C  -4.872233 -0.97118 0.162943
C  3.023914 3.183261 0.252619
C  -5.078102 0.218051 -0.514565
C  3.477452 4.068593 -0.892986
C  3.737042 3.497423 1.551662
C  2.838486 -0.348227 2.773066
H  1.392618 -0.739777 -2.271068
H  3.241735 -2.846584 -1.107406
H  -1.152064 -1.86048 1.187629
H  -0.218615 -0.054803 -0.947143
H  4.295805 -2.818693 -3.370297
H  4.476994 -1.247582 -2.602706
H  3.261514 -1.479166 -3.852098
H  1.068548 -3.808668 -1.808137
H  2.337224 -4.278371 -2.925068
H  1.206428 -3.01157 -3.380106
H  3.57869 -0.491172 -0.314846
H  -0.529469 1.10864 1.495024
H  -1.529077 0.190328 2.627763
H  -1.925376 1.39463 -0.596392
H  -3.431193 -2.243458 1.089414
H  -4.182715 1.991087 -1.323215
H  -5.703842 -1.627745 0.377661
H  1.946837 3.297307 0.394526
H  4.54786 3.9600 -1.073329
H  3.283317 5.114763 -0.65458
H  2.943017 3.835407 -1.812579
H  4.816148 3.371049 1.456527
H  3.547129 4.531716 1.83824
H  3.382124 2.858475 2.359937
H  2.941468 -1.415036 2.573397
H  3.645162 0.200502 2.293504
H  2.882867 -0.185973 3.850335
totalener: -1686.33254788 hartree
nucrepener: 2820.20139458 hartree
electener: -4506.53394246 hartree
oneelecener: -7915.49058565 hartree
twoeener: 3408.95664320 hartree
kineticenergy: 1680.39580444 hartree
xcener: -138.342504392619 hartree
chargesum: 0.0000000
charge: -0.075683 -0.404050 -0.318046 -0.259312 -0.469772 -0.341700 -0.170909 -0.214185 0.059287 0.051101 0.155712 0.160506 -0.250807 -0.286952 -0.140345 0.024281 0.484102 -0.193837 -0.140589 0.323839 -0.166525 -0.134078 0.147544 0.097496 -0.254314 -0.240957 -0.157440 0.092049 0.046011 0.106453 0.166076 0.088402 0.082825 0.076583 0.106962 0.084175 0.080257 0.149178 0.092533 0.113091 0.121828 0.119115 0.121962 0.121708 0.059658 0.082901 0.083069 0.103129 0.086330 0.085647 0.091384 0.139114 0.087621 0.127570
qa: -0.0757 -0.4040 -0.3180 -0.2593 -0.4698 -0.3417 -0.1709 -0.2142 0.0593 0.0511 0.1557 0.1605 -0.2508 -0.2870 -0.1403 0.0243 0.4841 -0.1938 -0.1406 0.3238 -0.1665 -0.1341 0.1475 0.0975 -0.2543 -0.2410 -0.1574 0.0920 0.0460 0.1065 0.1661 0.0884 0.0828 0.0766 0.1070 0.0842 0.0803 0.1492 0.0925 0.1131 0.1218 0.1191 0.1220 0.1217 0.0597 0.0829 0.0831 0.1031 0.0863 0.0856 0.0914 0.1391 0.0876 0.1276
va: 1.2296 2.0938 2.0912 2.0784 2.0231 2.1655 3.2219 3.1412 3.8680 3.8812 3.8086 4.2406 3.9327 3.9550 3.8642 3.6002 4.3130 4.0387 4.0144 4.2250 4.0803 4.0233 3.8660 3.9238 3.9202 3.9226 3.8707 1.0264 1.0356 1.0456 1.0403 1.0073 1.0176 1.0063 1.0158 1.0052 1.0052 1.0388 1.0223 1.0258 1.0183 1.0109 1.0144 1.0136 1.0232 1.0085 1.0095 1.0167 1.0075 1.0116 1.0080 0.9970 0.9985 1.0022
dispcorr: -0.032029486 hartree
energy: -1686.364577367110
dipole: 46.81750 -45.73494 1.08257 2.55306 -1.59312 0.95994 -4.78257 4.25580 -0.52677
magnitude: 1.53978 au
magnitude: 3.91381 debye
