program: Orca
programVersion: 5.0.2
elementType: Cl O O O O O N N C C C C C C C C C C C C C C C C C C C H H H H H H H H H H H H H H H H H H H H H H H H H H H
charge: 0
multiplicity: 1
keywords: wb97x-d3
keywords: def2-TZVPP
keywords: def2/J RIJCOSX
keywords: DEFGRID2
keywords: scfconv7
keywords: smallprint printgap noloewdin
keywords: NOSOSCF
formula: C19H27ClN2O5
InChI: InChI=1/C19H27ClN2O5/c1-11(2)17(22-19(25)27-12(3)4)18(24)21-15(10-16(23)26-5)13-6-8-14(20)9-7-13/h6-9,11-12,15,17,21-22H,10H2,1-5H3
54 atoms
Cl -5.982339 1.382872 -0.216244
O  1.535081 -3.078607 -0.089399
O  3.174201 1.633193 -0.107813
O  -0.8229 0.436474 3.057142
O  1.377371 1.255424 -1.42113
O  0.979804 0.446977 1.741972
N  0.105859 -1.393654 -0.563959
N  2.927501 -0.35956 -1.017034
C  2.228428 -1.419232 -1.714092
C  3.200116 -2.41767 -2.344103
C  -0.864348 -1.720189 0.452376
C  1.260807 -2.074539 -0.716713
C  4.207681 -1.703507 -3.240349
C  2.437342 -3.466648 -3.147823
C  -0.33346 -1.551013 1.896991
C  -2.132216 -0.925143 0.249078
C  2.397642 0.880804 -0.879634
C  -3.362967 -1.544029 0.429829
C  -2.115502 0.430599 -0.069483
C  0.032363 -0.128886 2.210616
C  -4.550492 -0.843833 0.296932
C  -3.295269 1.143258 -0.212913
C  2.70837 2.93615 0.270727
C  -4.508653 0.501339 -0.028638
C  3.11517 3.957513 -0.774925
C  3.308885 3.219044 1.632774
C  -0.60995 1.805194 3.369429
H  1.657074 -0.949537 -2.519796
H  3.737213 -2.931644 -1.540171
H  -1.106824 -2.781948 0.354948
H  0.017966 -0.518708 -1.058257
H  4.812197 -0.977331 -2.698755
H  3.703791 -1.171065 -4.05031
H  4.887285 -2.424426 -3.696202
H  1.753548 -4.045735 -2.530212
H  3.131103 -4.169112 -3.610511
H  1.863056 -3.001055 -3.952539
H  3.647373 -0.62935 -0.365421
H  -1.099255 -1.911526 2.583796
H  0.550439 -2.178363 2.013836
H  -3.401426 -2.598822 0.674248
H  -1.180897 0.960929 -0.216994
H  -5.499373 -1.342861 0.435751
H  -3.268161 2.192676 -0.471353
H  1.620076 2.912133 0.355281
H  2.659794 3.740406 -1.73994
H  4.198842 3.98292 -0.897917
H  2.79096 4.953535 -0.471236
H  2.994421 2.468787 2.357031
H  4.399019 3.229866 1.594488
H  2.979516 4.195346 1.989113
H  -1.391663 2.077429 4.072244
H  0.365256 1.970109 3.827941
H  -0.689065 2.43355 2.481737
totalener: -1686.33392201 hartree
nucrepener: 2846.79564529 hartree
electener: -4533.12956730 hartree
oneelecener: -7969.31864892 hartree
twoeener: 3436.18908162 hartree
kineticenergy: 1680.39156828 hartree
xcener: -138.346281796365 hartree
chargesum: -0.0000000
charge: -0.076391 -0.419827 -0.314801 -0.249566 -0.481414 -0.387742 -0.203717 -0.197894 0.018596 0.064151 0.109934 0.238279 -0.256798 -0.289947 -0.108060 0.106914 0.497039 -0.178758 -0.247002 0.328966 -0.128008 -0.151968 0.164998 0.090844 -0.254728 -0.241711 -0.130714 0.099037 0.045643 0.091269 0.179769 0.084479 0.076642 0.086654 0.105036 0.082564 0.078060 0.141813 0.104195 0.125811 0.113798 0.138102 0.120647 0.122024 0.047582 0.102753 0.082224 0.079507 0.093923 0.086798 0.074582 0.126488 0.110419 0.099504
qa: -0.0764 -0.4198 -0.3148 -0.2496 -0.4814 -0.3877 -0.2037 -0.1979 0.0186 0.0642 0.1099 0.2383 -0.2568 -0.2899 -0.1081 0.1069 0.4970 -0.1788 -0.2470 0.3290 -0.1280 -0.1520 0.1650 0.0908 -0.2547 -0.2417 -0.1307 0.0990 0.0456 0.0913 0.1798 0.0845 0.0766 0.0867 0.1050 0.0826 0.0781 0.1418 0.1042 0.1258 0.1138 0.1381 0.1206 0.1220 0.0476 0.1028 0.0822 0.0795 0.0939 0.0868 0.0746 0.1265 0.1104 0.0995
va: 1.2294 2.0940 2.0961 2.1249 2.0110 2.1126 3.2278 3.1451 3.8704 3.8758 3.9082 4.2372 3.9345 3.9513 3.7653 3.5453 4.3069 4.0500 4.0224 4.1754 4.0221 4.0765 3.8585 3.9292 3.9316 3.9201 3.9008 1.0303 1.0333 1.0244 1.0356 1.0191 1.0059 1.0073 1.0181 1.0056 1.0048 1.0444 1.0295 1.0336 1.0112 1.0243 1.0134 1.0136 1.0268 1.0169 1.0092 1.0090 1.0175 1.0114 1.0074 0.9965 0.9938 0.9932
dispcorr: -0.032060284 hartree
energy: -1686.365982291693
dipole: 40.02704 -39.93906 0.08799 1.17395 -0.68618 0.48778 -5.47270 6.15195 0.67925
magnitude: 0.84086 au
magnitude: 2.13730 debye
