program: Orca
programVersion: 5.0.2
elementType: Cl O O O O O N N C C C C C C C C C C C C C C C C C C C H H H H H H H H H H H H H H H H H H H H H H H H H H H
charge: 0
multiplicity: 1
keywords: wb97x-d3
keywords: def2-TZVPP
keywords: def2/J RIJCOSX
keywords: DEFGRID2
keywords: scfconv7
keywords: smallprint printgap noloewdin
keywords: NOSOSCF
formula: C19H27ClN2O5
InChI: InChI=1/C19H27ClN2O5/c1-11(2)17(22-19(25)27-12(3)4)18(24)21-15(10-16(23)26-5)13-6-8-14(20)9-7-13/h6-9,11-12,15,17,21-22H,10H2,1-5H3
54 atoms
Cl -6.292825 -2.217001 -0.990047
O  1.284233 -1.546423 -0.699164
O  5.244263 0.786255 -1.3041
O  -2.286748 0.323305 4.126958
O  3.876655 2.557049 -0.981436
O  -1.524228 1.448653 2.36109
N  -0.005586 -0.112645 0.481278
N  3.071849 0.440472 -1.136509
C  1.683039 0.795229 -1.008086
C  1.058093 1.239683 -2.350796
C  -0.769876 -1.129028 1.160931
C  0.972554 -0.410045 -0.401051
C  -0.38556 1.700965 -2.184159
C  1.169561 0.185059 -3.444079
C  -0.862606 -0.844848 2.666949
C  -2.144114 -1.371815 0.570117
C  4.051519 1.369846 -1.128601
C  -2.913594 -0.356635 0.01399
C  -2.681857 -2.652982 0.625414
C  -1.589756 0.432339 3.006828
C  -4.188303 -0.610969 -0.468334
C  -3.954005 -2.924004 0.150567
C  6.40853 1.622576 -1.290665
C  -4.703612 -1.894172 -0.393774
C  7.477418 0.871365 -2.059379
C  6.830968 1.924231 0.136306
C  -2.985602 1.482894 4.57086
H  1.614261 1.644979 -0.321713
H  1.650726 2.108824 -2.652259
H  -0.201649 -2.05494 1.054492
H  -0.19197 0.849376 0.715656
H  -0.492054 2.430854 -1.378032
H  -1.058647 0.866819 -1.980439
H  -0.736417 2.18104 -3.097914
H  0.8262 0.597703 -4.393618
H  0.563167 -0.695254 -3.229232
H  2.198337 -0.143667 -3.588484
H  3.295189 -0.530518 -1.288116
H  -1.34102 -1.687566 3.1660
H  0.149884 -0.768809 3.077417
H  -2.526866 0.650822 -0.05342
H  -2.093311 -3.464899 1.036896
H  -4.776348 0.186921 -0.90024
H  -4.354653 -3.927136 0.194196
H  6.180161 2.5602 -1.803912
H  8.388901 1.467169 -2.105895
H  7.161574 0.663584 -3.081549
H  7.72179 -0.07629 -1.577576
H  7.050688 1.004915 0.681575
H  7.733782 2.535968 0.136086
H  6.05978 2.474561 0.672852
H  -3.732358 1.798654 3.842811
H  -3.477627 1.196771 5.495908
H  -2.305167 2.312912 4.760215
totalener: -1686.33552351 hartree
nucrepener: 2686.53315831 hartree
electener: -4372.86868182 hartree
oneelecener: -7648.45501968 hartree
twoeener: 3275.58633786 hartree
kineticenergy: 1680.39971936 hartree
xcener: -138.348518188546 hartree
chargesum: -0.0000000
charge: -0.077722 -0.427718 -0.321640 -0.259624 -0.442507 -0.404127 -0.225321 -0.269320 0.083584 0.081699 0.116116 0.263302 -0.341582 -0.289418 -0.118189 0.131634 0.459467 -0.254616 -0.203928 0.376534 -0.124758 -0.119015 0.147046 0.082633 -0.231093 -0.257922 -0.125757 0.099139 0.062151 0.101711 0.168002 0.098843 0.085952 0.099896 0.087934 0.088975 0.083318 0.161742 0.095456 0.107580 0.137863 0.113721 0.121592 0.119950 0.060531 0.075924 0.090646 0.081988 0.079962 0.080218 0.102162 0.112652 0.122767 0.111565
qa: -0.0777 -0.4277 -0.3216 -0.2596 -0.4425 -0.4041 -0.2253 -0.2693 0.0836 0.0817 0.1161 0.2633 -0.3416 -0.2894 -0.1182 0.1316 0.4595 -0.2546 -0.2039 0.3765 -0.1248 -0.1190 0.1470 0.0826 -0.2311 -0.2579 -0.1258 0.0991 0.0622 0.1017 0.1680 0.0988 0.0860 0.0999 0.0879 0.0890 0.0833 0.1617 0.0955 0.1076 0.1379 0.1137 0.1216 0.1199 0.0605 0.0759 0.0906 0.0820 0.0800 0.0802 0.1022 0.1127 0.1228 0.1116
va: 1.2282 2.0780 2.0895 2.1563 2.0680 2.0740 3.2034 3.1906 3.9074 3.7514 3.8292 4.2153 3.9757 3.9566 3.8966 3.5478 4.3570 4.0364 4.0744 4.1087 4.0538 4.0120 3.8747 3.9389 3.9304 3.9013 3.8867 1.0416 1.0252 1.0493 1.0384 1.0026 0.9968 1.0114 1.0019 1.0105 1.0179 1.0504 1.0268 1.0133 1.0081 1.0103 1.0137 1.0135 1.0240 1.0080 1.0109 1.0091 1.0090 1.0098 1.0198 0.9953 0.9933 0.9953
dispcorr: -0.028286254 hartree
energy: -1686.363809763124
dipole: 40.49452 -40.76718 -0.27266 16.90753 -16.91257 -0.00505 -3.81559 5.19204 1.37645
magnitude: 1.40321 au
magnitude: 3.56666 debye
