program: Orca
programVersion: 5.0.2
elementType: Cl O O O O O N N C C C C C C C C C C C C C C C C C C C H H H H H H H H H H H H H H H H H H H H H H H H H H H
charge: 0
multiplicity: 1
keywords: wb97x-d3
keywords: def2-TZVPP
keywords: def2/J RIJCOSX
keywords: DEFGRID2
keywords: scfconv7
keywords: smallprint printgap noloewdin
keywords: NOSOSCF
formula: C19H27ClN2O5
InChI: InChI=1/C19H27ClN2O5/c1-11(2)17(22-19(25)27-12(3)4)18(24)21-15(10-16(23)26-5)13-6-8-14(20)9-7-13/h6-9,11-12,15,17,21-22H,10H2,1-5H3
54 atoms
Cl -6.127345 -2.55519 -0.484419
O  1.269806 -1.782463 -0.538423
O  5.179314 0.67289 -0.781079
O  -2.532552 1.433422 3.333396
O  3.570277 2.245098 -0.585414
O  -1.517708 2.071201 1.454225
N  0.116186 -0.006314 0.26167
N  3.1254 0.171309 -1.40966
C  1.701741 0.33961 -1.551443
C  1.238813 0.046935 -2.988175
C  -0.64216 -0.747519 1.237261
C  1.009254 -0.596674 -0.562484
C  1.907841 1.00127 -3.969655
C  -0.279495 0.130032 -3.10815
C  -0.797857 0.053212 2.539463
C  -1.997528 -1.210386 0.740231
C  3.926641 1.131807 -0.88893
C  -2.713307 -0.515154 -0.226349
C  -2.579318 -2.33782 1.309291
C  -1.642674 1.291174 2.365049
C  -3.980083 -0.927457 -0.610675
C  -3.844611 -2.761436 0.939687
C  6.174413 1.559113 -0.249479
C  -4.543333 -2.045115 -0.0190
C  7.508196 1.053812 -0.762379
C  6.111008 1.582311 1.267219
C  -3.389749 2.568211 3.263756
H  1.477722 1.383809 -1.319392
H  1.541089 -0.978067 -3.229621
H  -0.054768 -1.636078 1.478538
H  -0.042891 0.986831 0.197318
H  2.994129 0.940589 -3.922233
H  1.62353 2.036203 -3.767379
H  1.608436 0.770797 -4.992706
H  -0.58719 -0.023608 -4.142729
H  -0.64789 1.113719 -2.804612
H  -0.789588 -0.623607 -2.508093
H  3.491535 -0.762009 -1.51219
H  -1.227172 -0.587857 3.308636
H  0.19206 0.361668 2.889486
H  -2.287334 0.359604 -0.698351
H  -2.032942 -2.908383 2.051658
H  -4.525187 -0.378517 -1.365971
H  -4.28047 -3.643515 1.38775
H  5.994793 2.566813 -0.632747
H  7.53823 1.044058 -1.851743
H  7.715673 0.044336 -0.404928
H  8.310164 1.703685 -0.412275
H  6.893216 2.231532 1.66228
H  5.1552 1.965509 1.620429
H  6.264572 0.584205 1.68041
H  -4.041659 2.501622 4.129929
H  -2.825995 3.500216 3.300853
H  -3.990218 2.55564 2.354308
totalener: -1686.33536676 hartree
nucrepener: 2707.19796037 hartree
electener: -4393.53332712 hartree
oneelecener: -7689.87284062 hartree
twoeener: 3296.33951349 hartree
kineticenergy: 1680.40633296 hartree
xcener: -138.347310239701 hartree
chargesum: 0.0000000
charge: -0.078431 -0.414873 -0.320363 -0.256771 -0.436370 -0.397733 -0.213381 -0.251652 0.024124 0.070973 0.121858 0.266703 -0.270963 -0.327182 -0.124462 0.147353 0.470172 -0.266303 -0.204659 0.371089 -0.121609 -0.124314 0.144677 0.087210 -0.232182 -0.258594 -0.124142 0.089667 0.047864 0.100781 0.171033 0.089250 0.083536 0.087556 0.091810 0.081780 0.110667 0.154303 0.094458 0.108772 0.134936 0.112426 0.120875 0.118347 0.062927 0.090912 0.082344 0.076780 0.080635 0.101727 0.081360 0.121039 0.111775 0.112264
qa: -0.0784 -0.4149 -0.3204 -0.2568 -0.4364 -0.3977 -0.2134 -0.2517 0.0241 0.0710 0.1219 0.2667 -0.2710 -0.3272 -0.1245 0.1474 0.4702 -0.2663 -0.2047 0.3711 -0.1216 -0.1243 0.1447 0.0872 -0.2322 -0.2586 -0.1241 0.0897 0.0479 0.1008 0.1710 0.0892 0.0835 0.0876 0.0918 0.0818 0.1107 0.1543 0.0945 0.1088 0.1349 0.1124 0.1209 0.1183 0.0629 0.0909 0.0823 0.0768 0.0806 0.1017 0.0814 0.1210 0.1118 0.1123
va: 1.2276 2.1146 2.0899 2.1514 2.0715 2.0845 3.1506 3.1533 3.9360 3.7948 3.8505 4.2149 3.9356 3.9654 3.8815 3.5243 4.3424 4.0335 4.0779 4.1272 4.0417 4.0164 3.8754 3.9331 3.9316 3.9000 3.8870 1.0539 1.0337 1.0387 1.0367 1.0175 1.0036 1.0066 1.0119 1.0036 1.0034 1.0456 1.0255 1.0154 1.0115 1.0102 1.0131 1.0137 1.0233 1.0107 1.0090 1.0082 1.0097 1.0200 1.0089 0.9938 0.9948 0.9954
dispcorr: -0.028478534 hartree
energy: -1686.363845290114
dipole: 40.00256 -40.09417 -0.09162 17.88082 -17.46375 0.41708 -5.74898 6.72832 0.97934
magnitude: 1.06839 au
magnitude: 2.71563 debye
