program: Orca
programVersion: 5.0.2
elementType: Cl O O O O O N N C C C C C C C C C C C C C C C C C C C H H H H H H H H H H H H H H H H H H H H H H H H H H H
charge: 0
multiplicity: 1
keywords: wb97x-d3
keywords: def2-TZVPP
keywords: def2/J RIJCOSX
keywords: DEFGRID2
keywords: scfconv7
keywords: smallprint printgap noloewdin
keywords: NOSOSCF
formula: C19H27ClN2O5
InChI: InChI=1/C19H27ClN2O5/c1-11(2)17(22-19(25)27-12(3)4)18(24)21-15(10-16(23)26-5)13-6-8-14(20)9-7-13/h6-9,11-12,15,17,21-22H,10H2,1-5H3
54 atoms
Cl -5.779133 -2.087331 -1.630643
O  1.275198 -1.344344 -0.656991
O  4.967667 0.597711 -1.949863
O  -2.673624 -0.320448 4.163257
O  4.368939 2.066488 -0.343516
O  -1.571402 1.089184 2.835043
N  0.197051 -0.194728 0.957493
N  2.848593 0.694285 -1.33967
C  1.754637 1.00589 -0.461784
C  0.742862 1.993612 -1.086705
C  -0.616729 -1.307244 1.379313
C  1.065281 -0.301472 -0.072524
C  0.036815 1.406567 -2.302832
C  1.420905 3.312419 -1.43703
C  -0.922608 -1.226058 2.88096
C  -1.892134 -1.474177 0.577188
C  4.091055 1.196913 -1.134822
C  -2.578802 -0.393942 0.036744
C  -2.423545 -2.747443 0.407238
C  -1.747483 -0.023042 3.267055
C  -3.771706 -0.577027 -0.64584
C  -3.614474 -2.947993 -0.269764
C  6.328777 1.046588 -1.920212
C  -4.287397 -1.854066 -0.789611
C  6.490809 2.293182 -2.771648
C  7.168889 -0.110747 -2.423973
C  -3.504246 0.742987 4.618797
H  2.163613 1.4719 0.440168
H  -0.012046 2.205002 -0.319643
H  -0.018303 -2.209065 1.232199
H  0.018182 0.703692 1.377795
H  -0.666415 2.12878 -2.718955
H  -0.525739 0.500804 -2.072187
H  0.753827 1.163828 -3.088689
H  1.952994 3.737187 -0.586223
H  0.68053 4.040564 -1.770888
H  2.140626 3.182891 -2.245705
H  2.764176 -0.159735 -1.87072
H  -1.426567 -2.139757 3.194574
H  0.021164 -1.175355 3.433817
H  -2.18583 0.608945 0.137238
H  -1.892286 -3.607425 0.798718
H  -4.295999 0.270999 -1.064066
H  -4.011127 -3.945223 -0.400392
H  6.60727 1.276092 -0.888572
H  5.895134 3.119337 -2.386386
H  6.197985 2.101773 -3.805145
H  7.533952 2.61142 -2.773047
H  6.913171 -0.371646 -3.451764
H  8.224535 0.159735 -2.400694
H  7.037421 -0.997032 -1.803584
H  -4.17159 0.304039 5.354758
H  -2.920628 1.538367 5.081851
H  -4.089542 1.165141 3.802162
totalener: -1686.33683869 hartree
nucrepener: 2702.00728188 hartree
electener: -4388.34412057 hartree
oneelecener: -7679.46800077 hartree
twoeener: 3291.12388021 hartree
kineticenergy: 1680.39907814 hartree
xcener: -138.348107347876 hartree
chargesum: -0.0000000
charge: -0.077941 -0.412881 -0.318798 -0.256930 -0.435986 -0.401989 -0.237017 -0.272563 0.093230 0.053309 0.126892 0.238263 -0.294551 -0.286249 -0.116789 0.162714 0.450509 -0.286439 -0.214930 0.371074 -0.114608 -0.116819 0.143726 0.079247 -0.257891 -0.231030 -0.125194 0.116637 0.028585 0.103955 0.167508 0.088214 0.099678 0.088861 0.103290 0.088898 0.081635 0.160383 0.095890 0.108067 0.135667 0.111587 0.120935 0.119950 0.061022 0.101820 0.080351 0.080203 0.081465 0.076105 0.091645 0.122486 0.111323 0.113481
qa: -0.0779 -0.4129 -0.3188 -0.2569 -0.4360 -0.4020 -0.2370 -0.2726 0.0932 0.0533 0.1269 0.2383 -0.2946 -0.2862 -0.1168 0.1627 0.4505 -0.2864 -0.2149 0.3711 -0.1146 -0.1168 0.1437 0.0792 -0.2579 -0.2310 -0.1252 0.1166 0.0286 0.1040 0.1675 0.0882 0.0997 0.0889 0.1033 0.0889 0.0816 0.1604 0.0959 0.1081 0.1357 0.1116 0.1209 0.1199 0.0610 0.1018 0.0804 0.0802 0.0815 0.0761 0.0916 0.1225 0.1113 0.1135
va: 1.2280 2.0910 2.0966 2.1555 2.0677 2.0794 3.1788 3.1905 3.8477 3.7841 3.8651 4.2763 3.9381 3.9585 3.8747 3.4715 4.3611 4.0438 4.0968 4.1282 4.0390 4.0083 3.8806 3.9400 3.9036 3.9324 3.8857 1.0367 1.0290 1.0302 1.0440 1.0041 1.0081 1.0151 1.0107 1.0059 1.0097 1.0545 1.0267 1.0143 1.0042 1.0108 1.0125 1.0132 1.0241 1.0194 1.0092 1.0098 1.0092 1.0078 1.0107 0.9935 0.9954 0.9949
dispcorr: -0.028898799 hartree
energy: -1686.365737485811
dipole: 37.47814 -38.10321 -0.62507 20.35314 -20.49211 -0.13897 -4.00675 5.26471 1.25796
magnitude: 1.41155 au
magnitude: 3.58789 debye
