program: Orca
programVersion: 5.0.2
elementType: Cl O O O O O N N C C C C C C C C C C C C C C C C C C C H H H H H H H H H H H H H H H H H H H H H H H H H H H
charge: 0
multiplicity: 1
keywords: wb97x-d3
keywords: def2-TZVPP
keywords: def2/J RIJCOSX
keywords: DEFGRID2
keywords: scfconv7
keywords: smallprint printgap noloewdin
keywords: NOSOSCF
formula: C19H27ClN2O5
InChI: InChI=1/C19H27ClN2O5/c1-11(2)17(22-19(25)27-12(3)4)18(24)21-15(10-16(23)26-5)13-6-8-14(20)9-7-13/h6-9,11-12,15,17,21-22H,10H2,1-5H3
54 atoms
Cl -6.000303 1.207898 -0.5126
O  1.929096 -2.393537 0.011967
O  3.449904 2.0622 -0.939757
O  -0.494629 0.303076 3.865816
O  1.457738 1.553815 -1.869414
O  -1.335443 -1.659172 3.211638
N  0.271621 -1.014172 -0.670216
N  3.0810 -0.014701 -1.598803
C  2.272561 -1.141799 -2.021352
C  3.133677 -2.253814 -2.618338
C  -0.552815 -1.140588 0.516441
C  1.47362 -1.609819 -0.797813
C  3.980015 -1.729618 -3.774272
C  2.251494 -3.406219 -3.088474
C  0.100961 -0.445645 1.719235
C  -1.919019 -0.560485 0.239084
C  2.564812 1.23275 -1.494103
C  -2.054918 0.734839 -0.255326
C  -3.068982 -1.292578 0.503622
C  -0.668665 -0.685124 2.990879
C  -3.304526 1.28301 -0.492459
C  -4.32684 -0.755737 0.277991
C  3.038403 3.416528 -0.690133
C  -4.436281 0.530789 -0.222327
C  4.308538 4.238822 -0.612817
C  2.221664 3.490377 0.5876
C  -1.141395 0.160324 5.123826
H  1.594916 -0.782191 -2.800804
H  3.794562 -2.633609 -1.83208
H  -0.654554 -2.20192 0.749615
H  0.024308 -0.309341 -1.346305
H  4.660972 -0.935038 -3.471996
H  3.350638 -1.334666 -4.57494
H  4.582087 -2.533971 -4.197931
H  2.860552 -4.194624 -3.531454
H  1.544596 -3.073878 -3.85237
H  1.686753 -3.854332 -2.272442
H  3.93835 -0.213708 -1.107809
H  1.105182 -0.854623 1.865437
H  0.215855 0.624127 1.533863
H  -1.179526 1.340222 -0.467284
H  -2.98553 -2.294595 0.902728
H  -3.39642 2.287396 -0.881501
H  -5.214362 -1.335354 0.490328
H  2.431475 3.763221 -1.529917
H  4.941477 3.92078 0.216677
H  4.058912 5.288509 -0.45888
H  4.886418 4.164998 -1.533709
H  1.939459 4.523907 0.790278
H  1.302396 2.91089 0.511443
H  2.793847 3.126025 1.442023
H  -0.894016 1.053542 5.691029
H  -2.223469 0.088743 5.012458
H  -0.787976 -0.720408 5.660916
totalener: -1686.33466187 hartree
nucrepener: 2753.36692031 hartree
electener: -4439.70158218 hartree
oneelecener: -7782.05286786 hartree
twoeener: 3342.35128568 hartree
kineticenergy: 1680.39479192 hartree
xcener: -138.342791277490 hartree
chargesum: 0.0000000
charge: -0.079699 -0.414328 -0.315307 -0.268215 -0.464448 -0.372146 -0.205521 -0.216907 0.027284 0.053568 0.210794 0.220713 -0.253138 -0.288052 -0.133019 -0.001797 0.479385 -0.186156 -0.123418 0.342490 -0.191528 -0.135950 0.146698 0.106496 -0.232441 -0.251330 -0.129543 0.093746 0.049604 0.096195 0.167844 0.082363 0.077287 0.088612 0.084445 0.079346 0.107880 0.146110 0.122780 0.075271 0.127462 0.119143 0.120559 0.120639 0.067741 0.083201 0.079518 0.093071 0.088011 0.079564 0.088560 0.116068 0.110428 0.110067
qa: -0.0797 -0.4143 -0.3153 -0.2682 -0.4644 -0.3721 -0.2055 -0.2169 0.0273 0.0536 0.2108 0.2207 -0.2531 -0.2881 -0.1330 -0.0018 0.4794 -0.1862 -0.1234 0.3425 -0.1915 -0.1360 0.1467 0.1065 -0.2324 -0.2513 -0.1295 0.0937 0.0496 0.0962 0.1678 0.0824 0.0773 0.0886 0.0844 0.0793 0.1079 0.1461 0.1228 0.0753 0.1275 0.1191 0.1206 0.1206 0.0677 0.0832 0.0795 0.0931 0.0880 0.0796 0.0886 0.1161 0.1104 0.1101
va: 1.2256 2.0992 2.0992 2.1280 2.0270 2.1256 3.2309 3.1341 3.8859 3.8707 3.7413 4.2322 3.9338 3.9552 3.8583 3.5611 4.3191 4.0160 4.0080 4.2179 4.1152 4.0213 3.8578 3.9067 3.9365 3.9131 3.9003 1.0266 1.0361 1.0448 1.0330 1.0178 1.0058 1.0075 1.0051 1.0054 1.0148 1.0422 1.0291 1.0284 1.0173 1.0206 1.0151 1.0129 1.0213 1.0086 1.0077 1.0106 1.0120 1.0128 1.0097 0.9945 0.9947 0.9945
dispcorr: -0.028901779 hartree
energy: -1686.363563651436
dipole: 40.66962 -39.60441 1.06521 1.84377 -0.75384 1.08993 -5.29040 5.37099 0.08059
magnitude: 1.52614 au
magnitude: 3.87915 debye
