program: Orca
programVersion: 5.0.2
elementType: Cl O O O O O N N C C C C C C C C C C C C C C C C C C C H H H H H H H H H H H H H H H H H H H H H H H H H H H
charge: 0
multiplicity: 1
keywords: wb97x-d3
keywords: def2-TZVPP
keywords: def2/J RIJCOSX
keywords: DEFGRID2
keywords: scfconv7
keywords: smallprint printgap noloewdin
keywords: NOSOSCF
formula: C19H27ClN2O5
InChI: InChI=1/C19H27ClN2O5/c1-11(2)17(22-19(25)27-12(3)4)18(24)21-15(10-16(23)26-5)13-6-8-14(20)9-7-13/h6-9,11-12,15,17,21-22H,10H2,1-5H3
54 atoms
Cl -6.638525 0.640238 -0.947271
O  1.208476 -2.471905 0.462306
O  3.226792 1.943241 -0.187764
O  0.635398 -1.206214 3.321801
O  1.328602 1.567792 -1.344965
O  1.757159 0.328605 2.145338
N  -0.128074 -0.818826 -0.322687
N  2.805512 -0.104143 -0.885804
C  1.992344 -1.176081 -1.424273
C  2.858771 -2.343868 -1.896262
C  -1.060475 -0.821416 0.781859
C  0.986611 -1.584327 -0.337857
C  3.920723 -1.871758 -2.884878
C  1.990891 -3.426658 -2.530392
C  -0.626848 0.155759 1.896433
C  -2.450261 -0.465784 0.312923
C  2.359717 1.175357 -0.835521
C  -2.695481 0.710929 -0.388884
C  -3.525314 -1.291231 0.613447
C  0.724437 -0.205096 2.455578
C  -3.97733 1.053521 -0.784507
C  -4.816179 -0.960202 0.231184
C  2.854316 3.295286 0.1143
C  -5.034502 0.21421 -0.467842
C  3.262223 4.213204 -1.023071
C  3.536017 3.636598 1.423783
C  1.857571 -1.765609 3.784326
H  1.457788 -0.775028 -2.290294
H  3.354602 -2.777253 -1.021334
H  -1.073885 -1.832396 1.191445
H  -0.123038 -0.008308 -0.926425
H  4.600208 -1.139188 -2.452034
H  3.463835 -1.414416 -3.765391
H  4.520307 -2.715445 -3.228396
H  1.456621 -3.039945 -3.401427
H  1.259631 -3.833005 -1.833857
H  2.609137 -4.257256 -2.871956
H  3.510637 -0.361273 -0.212204
H  -0.578376 1.168885 1.495201
H  -1.379914 0.137837 2.686382
H  -1.883828 1.387114 -0.635437
H  -3.357711 -2.213045 1.156785
H  -4.154102 1.968811 -1.331998
H  -5.643472 -1.612908 0.47265
H  1.770896 3.343967 0.24717
H  3.004082 5.244893 -0.781811
H  2.750458 3.951245 -1.948141
H  4.338702 4.169941 -1.195331
H  3.277563 4.651813 1.72525
H  3.220277 2.955576 2.213093
H  4.621694 3.581596 1.332978
H  2.435582 -2.171715 2.955004
H  2.460532 -1.032465 4.32045
H  1.580791 -2.570412 4.45978
totalener: -1686.33567959 hartree
nucrepener: 2810.21553523 hartree
electener: -4496.55121482 hartree
oneelecener: -7896.20858100 hartree
twoeener: 3399.65736617 hartree
kineticenergy: 1680.39372720 hartree
xcener: -138.344651539341 hartree
chargesum: -0.0000000
charge: -0.076182 -0.421329 -0.302452 -0.253807 -0.482031 -0.384287 -0.179515 -0.200777 0.054297 0.052139 0.146257 0.176844 -0.253599 -0.288023 -0.134118 0.022585 0.484416 -0.191979 -0.142569 0.359809 -0.162021 -0.134665 0.144702 0.096281 -0.254167 -0.227115 -0.123751 0.095960 0.043361 0.103908 0.175487 0.086319 0.076122 0.086289 0.079294 0.104698 0.082521 0.146492 0.098459 0.108484 0.121669 0.116183 0.122299 0.120852 0.053264 0.080472 0.101217 0.081947 0.074703 0.100648 0.078954 0.112973 0.107689 0.114794
qa: -0.0762 -0.4213 -0.3025 -0.2538 -0.4820 -0.3843 -0.1795 -0.2008 0.0543 0.0521 0.1463 0.1768 -0.2536 -0.2880 -0.1341 0.0226 0.4844 -0.1920 -0.1426 0.3598 -0.1620 -0.1347 0.1447 0.0963 -0.2542 -0.2271 -0.1238 0.0960 0.0434 0.1039 0.1755 0.0863 0.0761 0.0863 0.0793 0.1047 0.0825 0.1465 0.0985 0.1085 0.1217 0.1162 0.1223 0.1209 0.0533 0.0805 0.1012 0.0819 0.0747 0.1006 0.0790 0.1130 0.1077 0.1148
va: 1.2291 2.0744 2.1098 2.1360 2.0078 2.0871 3.2010 3.1413 3.8610 3.8873 3.8298 4.2554 3.9330 3.9519 3.8840 3.6276 4.3206 4.0374 4.0127 4.1603 4.0777 4.0238 3.8783 3.9240 3.9228 3.9256 3.8877 1.0286 1.0342 1.0494 1.0428 1.0186 1.0063 1.0071 1.0052 1.0178 1.0055 1.0439 1.0213 1.0292 1.0205 1.0111 1.0142 1.0138 1.0241 1.0096 1.0166 1.0090 1.0083 1.0154 1.0104 1.0011 0.9951 0.9961
dispcorr: -0.030805280 hartree
energy: -1686.366484869349
dipole: 44.44654 -43.97991 0.46663 0.15720 -0.04105 0.11615 -2.36485 2.86774 0.50289
magnitude: 0.69580 au
magnitude: 1.76857 debye
