program: Orca
programVersion: 5.0.2
elementType: Cl O O O O O N N C C C C C C C C C C C C C C C C C C C H H H H H H H H H H H H H H H H H H H H H H H H H H H
charge: 0
multiplicity: 1
keywords: wb97x-d3
keywords: def2-TZVPP
keywords: def2/J RIJCOSX
keywords: DEFGRID2
keywords: scfconv7
keywords: smallprint printgap noloewdin
keywords: NOSOSCF
formula: C19H27ClN2O5
InChI: InChI=1/C19H27ClN2O5/c1-11(2)17(22-19(25)27-12(3)4)18(24)21-15(10-16(23)26-5)13-6-8-14(20)9-7-13/h6-9,11-12,15,17,21-22H,10H2,1-5H3
54 atoms
Cl -5.904108 1.058751 -0.005988
O  2.082075 -2.460092 0.097784
O  3.240765 2.10432 -1.072023
O  -0.92084 -1.489174 3.465769
O  1.290658 1.399395 -1.962798
O  -0.56095 0.700398 3.720021
N  0.362385 -1.138777 -0.544504
N  3.027438 -0.026965 -1.613653
C  2.309437 -1.235236 -1.973101
C  3.246816 -2.299187 -2.541375
C  -0.372591 -1.202298 0.703998
C  1.574454 -1.707671 -0.709798
C  4.055912 -1.753148 -3.713794
C  2.4443 -3.521889 -2.976477
C  0.36803 -0.42983 1.812737
C  -1.759878 -0.645984 0.496389
C  2.420049 1.183238 -1.575846
C  -1.94335 0.65426 0.032655
C  -2.881772 -1.405585 0.79997
C  -0.415104 -0.310969 3.093407
C  -3.212727 1.182359 -0.129403
C  -4.159601 -0.889661 0.649446
C  2.739627 3.443169 -0.911026
C  -4.316459 0.405274 0.184567
C  3.955541 4.346557 -0.880091
C  1.909914 3.548974 0.356039
C  -1.708267 -1.497975 4.64873
H  1.58836 -0.964514 -2.749333
H  3.933385 -2.609586 -1.74685
H  -0.447669 -2.249725 1.00096
H  0.073608 -0.450374 -1.222955
H  4.707773 -2.529083 -4.116283
H  4.685604 -0.909336 -3.434812
H  3.402558 -1.421173 -4.523577
H  1.903669 -3.977019 -2.148321
H  3.105842 -4.283907 -3.388871
H  1.723677 -3.260368 -3.754695
H  3.900192 -0.132403 -1.120537
H  1.312753 -0.93826 2.023329
H  0.606063 0.578999 1.473449
H  -1.090065 1.276312 -0.214349
H  -2.759899 -2.418023 1.163313
H  -3.342304 2.192258 -0.492194
H  -5.025385 -1.490926 0.889952
H  2.119244 3.694386 -1.774742
H  4.543562 4.254149 -1.793022
H  4.600646 4.117489 -0.030791
H  3.640449 5.385968 -0.789917
H  1.557782 4.572726 0.485524
H  1.030703 2.90683 0.320048
H  2.497933 3.28454 1.236122
H  -1.13327 -1.177723 5.5181
H  -2.581805 -0.852693 4.550915
H  -2.030247 -2.526711 4.787426
totalener: -1686.33284914 hartree
nucrepener: 2775.93295738 hartree
electener: -4462.26580652 hartree
oneelecener: -7826.98683100 hartree
twoeener: 3364.72102448 hartree
kineticenergy: 1680.39044904 hartree
xcener: -138.341492972380 hartree
chargesum: 0.0000000
charge: -0.076433 -0.412725 -0.312567 -0.273484 -0.464044 -0.346886 -0.209298 -0.212782 0.031247 0.052530 0.215716 0.213976 -0.252766 -0.288146 -0.127982 0.006450 0.471128 -0.156979 -0.164560 0.327363 -0.181585 -0.135115 0.149691 0.111125 -0.232815 -0.254766 -0.140409 0.097785 0.049841 0.089715 0.172037 0.088587 0.082129 0.077663 0.106690 0.084100 0.079139 0.145826 0.121551 0.072815 0.110589 0.113607 0.120475 0.120160 0.067179 0.092201 0.083833 0.080360 0.091439 0.079771 0.091340 0.117698 0.112897 0.114690
qa: -0.0764 -0.4127 -0.3126 -0.2735 -0.4640 -0.3469 -0.2093 -0.2128 0.0312 0.0525 0.2157 0.2140 -0.2528 -0.2881 -0.1280 0.0065 0.4711 -0.1570 -0.1646 0.3274 -0.1816 -0.1351 0.1497 0.1111 -0.2328 -0.2548 -0.1404 0.0978 0.0498 0.0897 0.1720 0.0886 0.0821 0.0777 0.1067 0.0841 0.0791 0.1458 0.1216 0.0728 0.1106 0.1136 0.1205 0.1202 0.0672 0.0922 0.0838 0.0804 0.0914 0.0798 0.0913 0.1177 0.1129 0.1147
va: 1.2292 2.1013 2.0998 2.0982 2.0259 2.1590 3.2079 3.1324 3.8714 3.8742 3.7446 4.2431 3.9337 3.9541 3.8396 3.5215 4.3279 4.0294 4.0008 4.2476 4.1230 4.0228 3.8446 3.9128 3.9370 3.9170 3.8933 1.0279 1.0355 1.0418 1.0342 1.0074 1.0178 1.0061 1.0153 1.0055 1.0054 1.0421 1.0290 1.0313 1.0240 1.0170 1.0140 1.0134 1.0206 1.0105 1.0087 1.0078 1.0130 1.0080 1.0098 0.9967 0.9943 0.9940
dispcorr: -0.030109764 hartree
energy: -1686.362958904911
dipole: 38.28127 -37.62120 0.66007 -1.33860 1.31433 -0.02426 -8.94133 8.60681 -0.33453
magnitude: 0.74040 au
magnitude: 1.88195 debye
