program: Orca
programVersion: 5.0.2
elementType: Cl O O O O O N N C C C C C C C C C C C C C C C C C C C H H H H H H H H H H H H H H H H H H H H H H H H H H H
charge: 0
multiplicity: 1
keywords: wb97x-d3
keywords: def2-TZVPP
keywords: def2/J RIJCOSX
keywords: DEFGRID2
keywords: scfconv7
keywords: smallprint printgap noloewdin
keywords: NOSOSCF
formula: C19H27ClN2O5
InChI: InChI=1/C19H27ClN2O5/c1-11(2)17(22-19(25)27-12(3)4)18(24)21-15(10-16(23)26-5)13-6-8-14(20)9-7-13/h6-9,11-12,15,17,21-22H,10H2,1-5H3
54 atoms
Cl -4.161536 3.535686 0.229101
O  1.449485 -0.603034 1.659979
O  1.402888 2.468295 -1.912397
O  0.079282 -4.011577 2.948582
O  1.035685 0.35768 -2.623115
O  -0.196478 -4.292214 0.751049
N  0.316715 -1.408645 -0.140131
N  2.415986 0.801431 -0.871745
C  2.564293 -0.582012 -0.466255
C  3.918981 -0.842179 0.190153
C  -1.009221 -1.596508 0.427404
C  1.393348 -0.887676 0.476748
C  5.060899 -0.421999 -0.728156
C  4.044683 -2.318182 0.556075
C  -0.998833 -2.277587 1.793197
C  -1.81106 -0.311319 0.428976
C  1.559567 1.146302 -1.868841
C  -1.460142 0.779404 1.222694
C  -2.920017 -0.194137 -0.399548
C  -0.325807 -3.626547 1.741907
C  -2.187006 1.956754 1.172427
C  -3.660308 0.977529 -0.458496
C  0.441381 3.002844 -2.839659
C  -3.280948 2.051476 0.325848
C  0.83806 4.446283 -3.073346
C  -0.960278 2.874415 -2.272471
C  0.695331 -5.288219 3.040597
H  2.502259 -1.193526 -1.369783
H  3.969958 -0.258435 1.114887
H  -1.504135 -2.286366 -0.259331
H  0.367485 -1.483568 -1.143466
H  6.022721 -0.617641 -0.252946
H  5.026511 0.637272 -0.978576
H  5.038602 -0.981752 -1.665822
H  5.015238 -2.516728 1.011208
H  3.963632 -2.951653 -0.330173
H  3.282782 -2.633851 1.268104
H  2.641449 1.505982 -0.186709
H  -0.546112 -1.658213 2.563497
H  -2.039443 -2.437184 2.09457
H  -0.604637 0.719797 1.881677
H  -3.214912 -1.029032 -1.024214
H  -1.900377 2.799938 1.78584
H  -4.515575 1.054204 -1.115374
H  0.509303 2.447596 -3.778231
H  1.849307 4.524262 -3.472057
H  0.785253 5.026538 -2.151199
H  0.158914 4.902817 -3.793175
H  -1.685183 3.282121 -2.977852
H  -1.230863 1.835849 -2.086923
H  -1.058661 3.428289 -1.338219
H  0.026024 -6.085338 2.715302
H  1.607822 -5.336418 2.44554
H  0.940646 -5.427376 4.089927
totalener: -1686.33213598 hartree
nucrepener: 2837.28444387 hartree
electener: -4523.61657985 hartree
oneelecener: -7950.26208843 hartree
twoeener: 3426.64550859 hartree
kineticenergy: 1680.40953759 hartree
xcener: -138.347383502873 hartree
chargesum: 0.0000000
charge: -0.081939 -0.439132 -0.314564 -0.262032 -0.449819 -0.366825 -0.138146 -0.220619 0.064457 0.043400 0.188006 0.189618 -0.255357 -0.279198 -0.154337 -0.039758 0.468352 -0.182261 -0.143829 0.346056 -0.148528 -0.133986 0.154385 0.073616 -0.231918 -0.256159 -0.127657 0.097017 0.047680 0.099564 0.156258 0.086598 0.085712 0.077412 0.083665 0.082967 0.096112 0.143315 0.122042 0.106368 0.150627 0.109046 0.121703 0.117639 0.067440 0.092040 0.082312 0.078727 0.090834 0.094391 0.075790 0.109231 0.105045 0.118639
qa: -0.0819 -0.4391 -0.3146 -0.2620 -0.4498 -0.3668 -0.1381 -0.2206 0.0645 0.0434 0.1880 0.1896 -0.2554 -0.2792 -0.1543 -0.0398 0.4684 -0.1823 -0.1438 0.3461 -0.1485 -0.1340 0.1544 0.0736 -0.2319 -0.2562 -0.1277 0.0970 0.0477 0.0996 0.1563 0.0866 0.0857 0.0774 0.0837 0.0830 0.0961 0.1433 0.1220 0.1064 0.1506 0.1090 0.1217 0.1176 0.0674 0.0920 0.0823 0.0787 0.0908 0.0944 0.0758 0.1092 0.1050 0.1186
va: 1.2199 2.0583 2.1021 2.1248 2.0514 2.1356 3.1651 3.1335 3.8996 3.8903 3.7688 4.2290 3.9349 3.9589 3.8075 3.5962 4.3423 3.9620 4.0021 4.1987 4.0135 4.0098 3.8822 3.8748 3.9330 3.8944 3.9021 1.0285 1.0375 1.0321 1.0392 1.0072 1.0178 1.0059 1.0049 1.0065 1.0143 1.0445 1.0447 1.0154 1.0237 1.0127 1.0147 1.0157 1.0222 1.0109 1.0091 1.0081 1.0121 1.0180 1.0089 0.9959 0.9929 0.9940
dispcorr: -0.032103785 hartree
energy: -1686.364239760352
dipole: 29.52170 -29.30199 0.21971 -9.36559 9.28871 -0.07688 -6.30231 6.42292 0.12062
magnitude: 0.26217 au
magnitude: 0.66638 debye
