program: Orca
programVersion: 5.0.2
elementType: Cl O O O O O N N C C C C C C C C C C C C C C C C C C C H H H H H H H H H H H H H H H H H H H H H H H H H H H
charge: 0
multiplicity: 1
keywords: wb97x-d3
keywords: def2-TZVPP
keywords: def2/J RIJCOSX
keywords: DEFGRID2
keywords: scfconv7
keywords: smallprint printgap noloewdin
keywords: NOSOSCF
formula: C19H27ClN2O5
InChI: InChI=1/C19H27ClN2O5/c1-11(2)17(22-19(25)27-12(3)4)18(24)21-15(10-16(23)26-5)13-6-8-14(20)9-7-13/h6-9,11-12,15,17,21-22H,10H2,1-5H3
54 atoms
Cl -6.026807 0.95588 -0.574498
O  1.981492 -2.447661 0.056176
O  3.300732 2.080334 -0.937481
O  -0.531542 0.268189 3.846195
O  1.354712 1.463105 -1.898776
O  -1.332463 -1.726439 3.240063
N  0.287366 -1.126765 -0.651528
N  3.044097 -0.022323 -1.565191
C  2.302306 -1.196421 -1.983258
C  3.227592 -2.272607 -2.548353
C  -0.538534 -1.255707 0.534003
C  1.508544 -1.685283 -0.763696
C  4.077365 -1.723865 -3.6901
C  2.407405 -3.46789 -3.024687
C  0.096455 -0.528117 1.727596
C  -1.915133 -0.708949 0.241482
C  2.467247 1.200536 -1.494422
C  -3.050984 -1.460274 0.512557
C  -2.074705 0.574369 -0.276495
C  -0.68116 -0.747361 2.997766
C  -4.318321 -0.954706 0.268723
C  -3.333893 1.090999 -0.532301
C  2.829121 3.422944 -0.734498
C  -4.451254 0.319599 -0.256581
C  4.064631 4.294274 -0.635439
C  1.967447 3.497357 0.513585
C  -1.184384 0.149778 5.103464
H  1.619273 -0.883433 -2.777922
H  3.886304 -2.613799 -1.742835
H  -0.618269 -2.315551 0.782226
H  0.02308 -0.438569 -1.338473
H  3.451549 -1.363323 -4.509468
H  4.722559 -2.506268 -4.090739
H  4.717501 -0.898689 -3.380355
H  3.059654 -4.234349 -3.443807
H  1.704733 -3.174406 -3.808018
H  1.844006 -3.930398 -2.215874
H  3.901701 -0.169287 -1.056635
H  1.104102 -0.922324 1.890261
H  0.200551 0.538629 1.519869
H  -2.948358 -2.452767 0.930567
H  -1.21093 1.194006 -0.49445
H  -5.19491 -1.549117 0.485486
H  -3.444382 2.085652 -0.941024
H  2.238346 3.725839 -1.602337
H  4.681982 4.016382 0.219803
H  3.77162 5.336589 -0.510958
H  4.674113 4.224488 -1.536023
H  2.522379 3.173381 1.395191
H  1.643501 4.524871 0.681214
H  1.071573 2.884868 0.421305
H  -0.960146 1.064915 5.644908
H  -2.263967 0.052011 4.987582
H  -0.816373 -0.706273 5.669829
totalener: -1686.33457381 hartree
nucrepener: 2757.05865937 hartree
electener: -4443.39323319 hartree
oneelecener: -7789.42051753 hartree
twoeener: 3346.02728434 hartree
kineticenergy: 1680.39510580 hartree
xcener: -138.342939000341 hartree
chargesum: -0.0000000
charge: -0.079772 -0.413879 -0.314906 -0.268259 -0.464863 -0.371459 -0.207341 -0.215798 0.026412 0.052312 0.212209 0.220286 -0.252717 -0.287806 -0.133094 -0.002213 0.478646 -0.123221 -0.183066 0.342765 -0.135863 -0.193686 0.147420 0.107224 -0.232517 -0.252781 -0.129603 0.095506 0.050099 0.096247 0.168695 0.077420 0.088616 0.082087 0.084005 0.079428 0.108002 0.145891 0.123016 0.074697 0.119060 0.124632 0.120648 0.120310 0.067486 0.083450 0.079616 0.093038 0.088869 0.088777 0.079650 0.115965 0.110339 0.110020
qa: -0.0798 -0.4139 -0.3149 -0.2683 -0.4649 -0.3715 -0.2073 -0.2158 0.0264 0.0523 0.2122 0.2203 -0.2527 -0.2878 -0.1331 -0.0022 0.4786 -0.1232 -0.1831 0.3428 -0.1359 -0.1937 0.1474 0.1072 -0.2325 -0.2528 -0.1296 0.0955 0.0501 0.0962 0.1687 0.0774 0.0886 0.0821 0.0840 0.0794 0.1080 0.1459 0.1230 0.0747 0.1191 0.1246 0.1206 0.1203 0.0675 0.0835 0.0796 0.0930 0.0889 0.0888 0.0796 0.1160 0.1103 0.1100
va: 1.2256 2.0992 2.0990 2.1271 2.0262 2.1269 3.2309 3.1342 3.8807 3.8717 3.7432 4.2360 3.9339 3.9547 3.8573 3.5590 4.3199 4.0082 4.0147 4.2176 4.0217 4.1195 3.8560 3.9055 3.9372 3.9129 3.9006 1.0266 1.0360 1.0438 1.0334 1.0060 1.0075 1.0176 1.0053 1.0054 1.0149 1.0423 1.0291 1.0285 1.0206 1.0190 1.0129 1.0152 1.0209 1.0086 1.0077 1.0106 1.0096 1.0122 1.0115 0.9946 0.9948 0.9944
dispcorr: -0.029026813 hartree
energy: -1686.363600626284
dipole: 40.47088 -39.42348 1.04741 3.12460 -1.97886 1.14574 -5.04195 5.11351 0.07156
magnitude: 1.55400 au
magnitude: 3.94994 debye
