program: Orca
programVersion: 5.0.2
elementType: Cl O O O O O N N C C C C C C C C C C C C C C C C C C C H H H H H H H H H H H H H H H H H H H H H H H H H H H
charge: 0
multiplicity: 1
keywords: wb97x-d3
keywords: def2-TZVPP
keywords: def2/J RIJCOSX
keywords: DEFGRID2
keywords: scfconv7
keywords: smallprint printgap noloewdin
keywords: NOSOSCF
formula: C19H27ClN2O5
InChI: InChI=1/C19H27ClN2O5/c1-11(2)17(22-19(25)27-12(3)4)18(24)21-15(10-16(23)26-5)13-6-8-14(20)9-7-13/h6-9,11-12,15,17,21-22H,10H2,1-5H3
54 atoms
Cl -3.238676 3.653118 1.230007
O  2.044804 -1.204767 0.946887
O  1.789589 2.473796 -1.991713
O  -1.807626 -3.15989 3.307011
O  0.84634 0.599903 -2.826396
O  -2.883363 -3.115983 1.351975
N  0.468426 -1.604084 -0.649455
N  2.679096 0.515527 -1.485231
C  2.682256 -0.926333 -1.351053
C  4.090128 -1.462118 -1.090008
C  -0.735075 -1.723852 0.162561
C  1.705733 -1.27625 -0.219003
C  5.045951 -1.044294 -2.202996
C  4.062452 -2.981836 -0.957387
C  -0.539762 -2.567896 1.420298
C  -1.359514 -0.376107 0.462278
C  1.687454 1.156308 -2.156313
C  -0.746227 0.545139 1.308479
C  -2.574927 -0.035012 -0.117573
C  -1.87893 -2.96602 1.993432
C  -1.326116 1.778342 1.555502
C  -3.166411 1.196715 0.117496
C  0.763141 3.309664 -2.555761
C  -2.532171 2.099011 0.952851
C  1.376258 4.688113 -2.698135
C  -0.464053 3.310267 -1.663709
C  -3.005174 -3.561989 3.959348
H  2.333185 -1.342907 -2.29975
H  4.443524 -1.047487 -0.140049
H  -1.438556 -2.270982 -0.468002
H  0.288232 -1.414339 -1.623801
H  5.110252 0.037114 -2.315081
H  4.732445 -1.455704 -3.164959
H  6.051041 -1.41554 -2.00038
H  5.069488 -3.368575 -0.799642
H  3.673559 -3.449644 -1.86492
H  3.454998 -3.312769 -0.116159
H  3.205069 1.044754 -0.807691
H  -0.002619 -3.486401 1.161362
H  0.062378 -2.064017 2.171809
H  0.19858 0.306912 1.778847
H  -3.078735 -0.744494 -0.761931
H  -0.840943 2.487918 2.211455
H  -4.110242 1.449908 -0.345059
H  0.49713 2.923899 -3.54292
H  1.652069 5.103233 -1.727834
H  0.656084 5.365071 -3.15717
H  2.26505 4.668094 -3.328473
H  -0.226305 3.683453 -0.666752
H  -1.230897 3.959942 -2.086598
H  -0.895263 2.31512 -1.565121
H  -2.755051 -3.654785 5.012347
H  -3.795297 -2.821299 3.837356
H  -3.366601 -4.520416 3.585572
totalener: -1686.33226784 hartree
nucrepener: 2824.07467400 hartree
electener: -4510.40694185 hartree
oneelecener: -7923.88392296 hartree
twoeener: 3413.47698112 hartree
kineticenergy: 1680.39679379 hartree
xcener: -138.344235022511 hartree
chargesum: -0.0000000
charge: -0.086242 -0.434473 -0.315055 -0.262265 -0.453290 -0.374362 -0.169347 -0.220320 0.054462 0.049042 0.171238 0.209546 -0.255129 -0.288482 -0.135604 -0.072886 0.474576 -0.143140 -0.109383 0.348969 -0.172846 -0.126609 0.156576 0.085472 -0.233487 -0.250574 -0.129902 0.090814 0.047057 0.104309 0.159764 0.086377 0.076487 0.087913 0.085694 0.080500 0.101854 0.145143 0.101455 0.114731 0.143216 0.107100 0.120943 0.117416 0.066112 0.082479 0.079638 0.091646 0.076618 0.090544 0.089255 0.118365 0.110612 0.107470
qa: -0.0862 -0.4345 -0.3151 -0.2623 -0.4533 -0.3744 -0.1693 -0.2203 0.0545 0.0490 0.1712 0.2095 -0.2551 -0.2885 -0.1356 -0.0729 0.4746 -0.1431 -0.1094 0.3490 -0.1728 -0.1266 0.1566 0.0855 -0.2335 -0.2506 -0.1299 0.0908 0.0471 0.1043 0.1598 0.0864 0.0765 0.0879 0.0857 0.0805 0.1019 0.1451 0.1015 0.1147 0.1432 0.1071 0.1209 0.1174 0.0661 0.0825 0.0796 0.0916 0.0766 0.0905 0.0893 0.1184 0.1106 0.1075
va: 1.2155 2.0693 2.1029 2.1380 2.0468 2.1221 3.1694 3.1356 3.9213 3.8723 3.8081 4.2006 3.9358 3.9563 3.8552 3.6239 4.3320 3.9206 4.0105 4.1586 4.0213 3.9985 3.8829 3.8499 3.9328 3.8960 3.8998 1.0276 1.0370 1.0306 1.0377 1.0182 1.0053 1.0071 1.0054 1.0056 1.0150 1.0440 1.0181 1.0364 1.0235 1.0163 1.0155 1.0150 1.0216 1.0088 1.0082 1.0110 1.0094 1.0124 1.0195 0.9945 0.9946 0.9948
dispcorr: -0.031762808 hartree
energy: -1686.364030652419
dipole: 25.66658 -25.16674 0.49984 -9.66087 9.51768 -0.14319 -12.43258 12.37893 -0.05365
magnitude: 0.52271 au
magnitude: 1.32862 debye
