program: Gaussian 09
title: 000064763
version: EM64L-G09RevD.01
frameworkgroup: C1[X(C14H25N3O4S)]
method: RPBEPBE
basis: SDD
operation: Freq
keyword: #p
keyword: freq=noraman
keyword: PBEPBE/SDD
title: #p freq=noraman PBEPBE/SDD
converged: YES YES NO NO
title: Mulliken charges:
elementType: S O O O O N N N C C C C C C C C C C C C C C H H H H H H H H H H H H H H H H H H H H H H H H H
charge: 0.145468 -0.263887 -0.331262 -0.395106 -0.276052 -0.398868 -0.373921 -0.565123 -0.015184 -0.132801 -0.096840 -0.682255 -0.683464 -0.675713 -0.679972 0.225817 -0.211009 -0.730016 0.221169 -0.257648 -0.497153 0.209433 0.263256 0.219702 0.238293 0.213648 0.231712 0.212719 0.233367 0.228066 0.232141 0.205831 0.212608 0.227123 0.236361 0.380603 0.264516 0.242549 0.218193 0.241399 0.366916 0.256823 0.273248 0.302575 0.284892 0.293253 0.384595
chargesum: 0.00000
title: Mulliken charges with hydrogens summed into heavy atoms:
elementType: S O O O O N N N C C C C C C C C C C C C C C
charge: 0.145468 -0.263887 -0.331262 -0.010511 -0.276052 -0.018265 -0.007004 0.013022 0.248072 -0.132801 -0.096840 -0.010613 -0.005666 -0.009675 -0.003880 0.225817 0.053507 -0.027875 0.221169 -0.000825 0.078670 0.209433
polarizability: 2.33879283e+02 1.09958701e+01 1.97859027e+02 3.30841633e+00 5.32881168e+00 1.75266444e+02
1716.lowfreq: -3.2208 -0.0013 -0.0013 -0.0009 5.4432 7.2809 15.1526 19.1485 29.9274
frequency: 14.9769 19.0770 29.8853 46.8638 57.4098 59.1422 73.0513 90.7467 101.2155 133.1289 147.6360 157.0888 179.1762 185.5904 188.0748 197.7937 205.1262 215.1399 219.0662 233.1185 246.8424 261.2620 275.2205 280.5558 303.7611 306.1452 321.7524 322.4092 333.0058 341.2250 345.0827 368.9259 398.7158 424.8236 439.7713 472.3834 500.0976 517.6055 550.2863 581.5494 590.0173 609.9115 625.4337 648.0166 667.7410 707.0458 720.3339 745.7882 751.2944 799.8255 809.9677 837.8552 862.0939 877.5816 886.1936 920.7034 931.8296 937.8621 964.0624 966.1199 988.3734 992.4892 1001.6973 1010.2321 1030.8832 1076.5275 1082.4187 1099.9796 1124.6819 1134.2800 1136.1486 1140.5650 1155.4771 1164.7696 1189.1830 1214.2555 1218.5705 1229.1379 1236.7802 1245.3609 1266.5097 1295.0298 1304.0196 1310.6131 1326.8631 1350.7058 1352.2988 1372.9484 1378.6029 1379.3489 1391.5258 1395.3139 1396.5034 1430.0925 1447.0053 1453.9616 1457.9388 1458.5272 1464.0940 1465.6202 1472.8873 1473.4826 1479.3838 1485.7472 1508.7386 1523.6147 1579.9710 1632.2973 1639.4056 1661.5890 2966.6505 2968.8741 2972.6887 2974.9810 2996.1075 3001.2888 3007.3022 3030.2340 3042.2459 3060.3172 3061.6841 3064.4612 3065.9371 3069.3259 3090.3903 3092.5959 3095.0683 3099.3449 3100.3704 3111.5543 3317.1506 3422.5151 3424.7944 3506.9847 3546.1760
redmass: 3.8180 6.2733 5.3757 7.1798 5.5585 4.4386 4.8496 7.1974 4.3518 3.2377 4.4375 2.2068 1.3789 1.3573 2.1835 3.9402 1.5866 1.4041 1.5724 1.2720 2.1186 1.2896 2.7620 3.5061 2.4687 3.1568 3.6731 2.9641 3.5070 3.2888 3.3824 3.9748 4.7527 3.7681 3.4984 4.1776 2.0103 3.5581 3.9563 3.4900 3.9224 3.3514 3.5383 1.3643 3.0405 4.1592 1.1935 4.2738 1.8206 3.1753 1.6716 2.1687 3.5931 3.4650 2.6523 2.2479 1.4486 1.4204 2.1452 1.8826 1.2836 1.7305 1.5286 3.0674 1.7635 1.9339 3.1142 1.7838 2.5015 1.8921 2.3403 2.1176 2.7056 1.5615 1.5639 3.5608 3.0458 2.2675 1.8195 2.8163 1.7865 1.4137 1.5397 1.8988 1.2738 1.3047 1.7552 1.2291 1.3674 1.4066 1.2008 1.1964 1.2225 1.0858 1.0512 1.0563 1.0493 1.0501 1.0548 1.0649 1.0601 1.0560 1.0488 1.0637 1.9079 1.6841 5.2886 4.9081 6.6694 1.0860 1.0391 1.0377 1.0373 1.0382 1.0832 1.0374 1.0624 1.0843 1.0853 1.0956 1.0965 1.0987 1.0967 1.0956 1.0999 1.0993 1.0994 1.0982 1.1009 1.0989 1.0824 1.0792 1.0469 1.0640 1.0949
irintensity: 0.1206 0.0770 0.2735 0.1611 5.0626 0.8428 2.7188 5.0505 1.3271 3.6758 4.2491 1.8982 0.9829 0.3511 4.3535 4.8740 2.4609 41.7279 0.3958 1.2031 1.5408 1.2180 0.7140 20.2864 0.2643 2.2168 18.0642 7.6488 30.2860 1.9164 5.3469 0.4487 4.3094 23.4295 16.7462 15.7068 21.5501 5.6493 6.1031 16.0153 37.1765 0.7835 1.2498 122.0192 44.1918 17.4012 135.6125 47.5127 299.4821 5.4771 37.2780 65.7551 11.3526 1.7231 6.4893 5.2652 0.5109 1.8390 35.4312 1.4481 0.1796 1.4399 3.0346 53.7274 20.6180 203.3232 63.2200 48.2821 16.4683 16.6693 0.8337 16.4659 1.4330 1.5704 19.9676 8.9059 20.8378 34.0256 40.7013 2.3680 0.4985 15.7036 18.1394 2.1553 1.6589 21.4276 53.6023 0.9097 47.3106 49.6482 22.4454 4.1361 35.4544 39.5471 1.2027 12.6451 4.0842 16.7927 11.3012 29.6876 15.2020 11.7953 3.3226 79.7242 148.2609 345.8640 81.9553 118.8073 311.3254 29.0816 28.8541 22.3776 44.4019 21.8089 9.3182 19.7602 9.4374 8.4688 9.2390 6.8033 8.2869 4.2879 34.4527 46.8190 1.9810 34.9999 45.7717 12.9875 19.5269 17.4475 213.0607 155.3408 9.6899 31.0599 7.3222
temp: 298.150 k
press: 1.00000 atm
elementType: 16 8 8 8 8 7 7 7 6 6 6 6 6 6 6 6 6 6 6 6 6 6 1 1 1 1 1 1 1 1 1 1 1 1 1 1 1 1 1 1 1 1 1 1 1 1 1
symmnumber: 1
zpe: 1015150.4 jmol-1
zpe.correction: 0.386650 hartree
zpe.thermalcorrener: 0.412615 hartree
zpe.thermalcorrenthalpy: 0.413559 hartree
zpe.thermalcorrgfe: 0.329416 hartree
zpe.sumelectzpe: -1410.007283 hartree
zpe.sumelectthermal: -1409.981318 hartree
zpe.sumelectthermalent: -1409.980374 hartree
zpe.sumelectthermalfe: -1410.064517 hartree
dipole: 4.8879 -0.1865 -1.0352
dipole: 4.9998
quadrupole: -132.6834 -149.2825 -139.5930
quadrupole: 4.7929 4.2005 -8.9796
quadrupole: 7.8363 -8.7629 0.9266 4.7929 4.2005 -8.9796
hfenergy: -1410.3939332 hartree
pointgroup: C01 [X(C14H25N3O4S1)]
dipole: -1.886343 -0.3378042 -0.4438132 debye
polarizability: 232.7913434|11.6649504|187.1009674|-6.2711704|-12.7690395|187.112443 unknown
InChI: InChI=1S/C14H25N3O4S/c1-7(16-11(21)8(15)6-9(18)19)10(20)17-12-13(2,3)22-14(12,4)5/h7-8,12,16-18H,6,15H2,1-5H3
charge 0 multiplicity 1
47 atoms
S  4.591559 1.540628 -0.421184
O  1.278003 -1.621552 2.257451
O  -0.557622 -0.102615 -1.675034
O  -5.869825 -0.652893 -0.726288
O  -4.270933 -0.381209 0.922412
N  1.575735 -0.723318 0.11453
N  -1.456908 -0.733583 0.376849
N  -2.126642 2.214404 -1.795724
C  2.896429 -0.154291 0.363042
C  3.906348 -0.24092 -0.837832
C  2.973187 1.393029 0.667222
C  4.971032 -1.333742 -0.677613
C  3.277542 -0.267605 -2.240856
C  1.835695 2.241171 0.078657
C  3.224448 1.722357 2.143681
C  0.857916 -1.398724 1.081864
C  -0.540688 -1.886091 0.582635
C  -1.161378 -2.883726 1.568156
C  -1.4326 0.044327 -0.74783
C  -2.528192 1.147141 -0.867137
C  -3.876905 0.54074 -1.345638
C  -4.638569 -0.196196 -0.266541
H  3.312767 -0.691419 1.233893
H  5.736003 -1.263158 -1.472512
H  5.480297 -1.255507 0.297656
H  4.498279 -2.333794 -0.747831
H  4.057752 -0.088669 -3.001678
H  2.822986 -1.257272 -2.445376
H  2.502278 0.505753 -2.37478
H  2.093903 3.313243 0.146506
H  1.640499 2.005412 -0.980538
H  0.901615 2.073484 0.652176
H  3.41613 2.802074 2.28519
H  2.337098 1.445396 2.74637
H  4.091633 1.164102 2.534807
H  1.086245 -0.525085 -0.775412
H  -0.392523 -2.355192 -0.410244
H  -1.247403 -2.437613 2.573609
H  -2.157864 -3.207666 1.219176
H  -0.512999 -3.769501 1.664987
H  -2.233816 -0.599727 1.039786
H  -2.694798 1.591483 0.131513
H  -3.735118 -0.130015 -2.214511
H  -4.50304 1.377531 -1.706968
H  -1.536292 2.927805 -1.352526
H  -1.650711 1.826387 -2.62225
H  -6.354953 -1.115285 0.010937
