program: Orca
programVersion: 5.0.2
elementType: Cl O O O O O N N C C C C C C C C C C C C C C C C C C C H H H H H H H H H H H H H H H H H H H H H H H H H H H
charge: 0
multiplicity: 1
keywords: wb97x-d3
keywords: def2-TZVPP
keywords: def2/J RIJCOSX
keywords: DEFGRID2
keywords: scfconv7
keywords: smallprint printgap noloewdin
keywords: NOSOSCF
formula: C19H27ClN2O5
InChI: InChI=1/C19H27ClN2O5/c1-11(2)17(22-19(25)27-12(3)4)18(24)21-15(10-16(23)26-5)13-6-8-14(20)9-7-13/h6-9,11-12,15,17,21-22H,10H2,1-5H3
54 atoms
Cl -5.626129 1.163926 -0.259633
O  0.067119 -2.441608 -2.070981
O  2.910814 2.00075 -0.517781
O  -0.877034 -0.122233 3.49892
O  1.09178 1.509876 -1.766207
O  0.951781 0.174249 2.25952
N  0.627975 -1.459154 -0.117805
N  2.648224 -0.062693 -1.26382
C  2.062658 -1.119038 -2.060974
C  3.13181 -2.198571 -2.332275
C  -0.522806 -1.923589 0.610237
C  0.809178 -1.730054 -1.427423
C  2.75034 -3.124059 -3.481548
C  3.48718 -3.005225 -1.084823
C  -0.210258 -1.917662 2.118583
C  -1.790995 -1.135921 0.336679
C  2.126285 1.190415 -1.230297
C  -3.015479 -1.677691 0.715014
C  -1.774413 0.125097 -0.24192
C  0.032188 -0.516998 2.623937
C  -4.196889 -0.980161 0.538121
C  -2.951305 0.836767 -0.427743
C  2.461714 3.346011 -0.285477
C  -4.155772 0.283046 -0.03171
C  3.702778 4.147849 0.053235
C  1.432718 3.381596 0.830175
C  -0.770848 1.213532 3.980093
H  1.740154 -0.705491 -3.020717
H  4.02525 -1.646566 -2.648183
H  -0.705303 -2.962827 0.322476
H  1.24644 -0.80706 0.338807
H  2.509488 -2.561356 -4.38371
H  1.887842 -3.741041 -3.2390
H  3.585036 -3.785571 -3.717154
H  2.652218 -3.631064 -0.766833
H  3.773403 -2.383003 -0.234389
H  4.32788 -3.667534 -1.292299
H  3.560822 -0.203409 -0.86293
H  -1.032673 -2.382672 2.65944
H  0.689234 -2.512091 2.297824
H  -3.056521 -2.670446 1.149217
H  -0.847022 0.56359 -0.583816
H  -5.141735 -1.416041 0.831635
H  -2.924463 1.813834 -0.890006
H  2.015377 3.733544 -1.204836
H  4.176091 3.779223 0.964251
H  3.435454 5.19194 0.214723
H  4.434707 4.112257 -0.753436
H  0.535747 2.821425 0.571345
H  1.83978 2.968761 1.753458
H  1.135623 4.41399 1.018946
H  0.166239 1.374105 4.513358
H  -0.841187 1.934231 3.165386
H  -1.606094 1.352028 4.660239
totalener: -1686.33323185 hartree
nucrepener: 2860.65014662 hartree
electener: -4546.98337847 hartree
oneelecener: -7997.08440348 hartree
twoeener: 3450.10102501 hartree
kineticenergy: 1680.38969379 hartree
xcener: -138.346493413369 hartree
chargesum: -0.0000000
charge: -0.085209 -0.393206 -0.312910 -0.246156 -0.427549 -0.400985 -0.220937 -0.255447 0.122280 -0.001991 0.084860 0.210850 -0.269029 -0.275954 -0.146864 0.059967 0.444138 -0.162801 -0.114901 0.368822 -0.158391 -0.201281 0.152881 0.130633 -0.238495 -0.254168 -0.127223 0.106453 0.048683 0.099365 0.170081 0.080359 0.102058 0.081013 0.089749 0.072450 0.096725 0.148339 0.097031 0.110511 0.106447 0.149898 0.115892 0.121119 0.066163 0.083331 0.078386 0.091234 0.086049 0.084373 0.089114 0.110816 0.108845 0.124583
qa: -0.0852 -0.3932 -0.3129 -0.2462 -0.4275 -0.4010 -0.2209 -0.2554 0.1223 -0.0020 0.0849 0.2108 -0.2690 -0.2760 -0.1469 0.0600 0.4441 -0.1628 -0.1149 0.3688 -0.1584 -0.2013 0.1529 0.1306 -0.2385 -0.2542 -0.1272 0.1065 0.0487 0.0994 0.1701 0.0804 0.1021 0.0810 0.0897 0.0725 0.0967 0.1483 0.0970 0.1105 0.1064 0.1499 0.1159 0.1211 0.0662 0.0833 0.0784 0.0912 0.0860 0.0844 0.0891 0.1108 0.1088 0.1246
va: 1.2207 2.1374 2.0935 2.1462 2.0746 2.0861 3.1303 3.1306 3.7924 3.9034 3.9281 4.2118 3.9685 3.9395 3.8784 3.5577 4.3447 4.0451 3.9211 4.1347 4.0620 4.1195 3.8747 3.8699 3.9404 3.8918 3.8908 1.0344 1.0138 1.0201 1.0617 1.0081 1.0170 1.0017 1.0091 1.0125 1.0079 1.0420 1.0265 1.0183 1.0098 1.0070 1.0150 1.0149 1.0217 1.0081 1.0084 1.0105 1.0201 1.0151 1.0094 0.9942 0.9924 0.9961
dispcorr: -0.032322315 hartree
energy: -1686.365554164508
dipole: 38.71489 -37.17743 1.53746 -1.25002 1.36599 0.11597 2.06635 -0.27208 1.79427
magnitude: 2.36572 au
magnitude: 6.01318 debye
