program: Orca
programVersion: 5.0.2
elementType: Cl O O O O O N N C C C C C C C C C C C C C C C C C C C H H H H H H H H H H H H H H H H H H H H H H H H H H H
charge: 0
multiplicity: 1
keywords: wb97x-d3
keywords: def2-TZVPP
keywords: def2/J RIJCOSX
keywords: DEFGRID2
keywords: scfconv7
keywords: smallprint printgap noloewdin
keywords: NOSOSCF
formula: C19H27ClN2O5
InChI: InChI=1/C19H27ClN2O5/c1-11(2)17(22-19(25)27-12(3)4)18(24)21-15(10-16(23)26-5)13-6-8-14(20)9-7-13/h6-9,11-12,15,17,21-22H,10H2,1-5H3
54 atoms
Cl -5.671468 1.044652 -0.315176
O  0.045675 -2.439054 -2.032278
O  2.951245 1.991073 -0.496937
O  -0.909666 -0.061931 3.492367
O  1.090031 1.53088 -1.693968
O  0.929951 0.217339 2.264813
N  0.628665 -1.465558 -0.081969
N  2.638567 -0.065235 -1.239759
C  2.033738 -1.10511 -2.043973
C  3.097186 -2.177435 -2.363299
C  -0.519047 -1.930111 0.651267
C  0.794317 -1.728532 -1.395178
C  2.694149 -3.072753 -3.528966
C  3.476476 -3.013392 -1.142666
C  -0.217156 -1.884673 2.161156
C  -1.797711 -1.169576 0.352043
C  2.134386 1.194768 -1.188534
C  -3.017406 -1.744441 0.6943
C  -1.796592 0.097963 -0.21292
C  0.010753 -0.470787 2.636024
C  -4.210686 -1.07334 0.495459
C  -2.98545 0.783171 -0.420761
C  2.53993 3.3478 -0.263757
C  -4.18566 0.196358 -0.060225
C  3.8076 4.121461 0.040382
C  1.537455 3.416547 0.874353
C  -0.82178 1.287035 3.938694
H  1.688874 -0.671415 -2.987031
H  3.984239 -1.617073 -2.682532
H  -0.685465 -2.978864 0.388912
H  1.24861 -0.811244 0.369224
H  3.520123 -3.735201 -3.790682
H  2.448368 -2.485636 -4.414079
H  1.828987 -3.687539 -3.291274
H  4.311026 -3.67267 -1.382394
H  2.646801 -3.644213 -0.820993
H  3.782567 -2.410587 -0.285109
H  3.560089 -0.216431 -0.863798
H  -1.040877 -2.343655 2.705356
H  0.685439 -2.46759 2.361682
H  -3.044332 -2.742781 1.116695
H  -0.871365 0.562388 -0.52627
H  -5.151866 -1.534642 0.760597
H  -2.971434 1.765401 -0.872491
H  2.082372 3.740064 -1.175632
H  4.52323 4.05449 -0.778752
H  4.288068 3.75364 0.947901
H  3.570971 5.174419 0.19079
H  1.951239 2.990162 1.788208
H  1.278383 4.457644 1.069782
H  0.61823 2.885016 0.635248
H  -0.89729 1.98455 3.104433
H  -1.662125 1.433341 4.610875
H  0.110684 1.473751 4.471475
totalener: -1686.33324078 hartree
nucrepener: 2857.53100150 hartree
electener: -4543.86424228 hartree
oneelecener: -7990.88486721 hartree
twoeener: 3447.02062492 hartree
kineticenergy: 1680.38899100 hartree
xcener: -138.346036644035 hartree
chargesum: -0.0000000
charge: -0.085658 -0.393328 -0.313324 -0.246015 -0.428072 -0.401089 -0.220189 -0.255661 0.121133 -0.001512 0.087759 0.209222 -0.269434 -0.275128 -0.145165 0.069472 0.446816 -0.166715 -0.125669 0.367495 -0.156657 -0.196906 0.150970 0.127804 -0.238228 -0.253317 -0.127326 0.105604 0.048230 0.098510 0.169471 0.080585 0.079829 0.103458 0.096224 0.090732 0.072486 0.148399 0.097024 0.110539 0.106832 0.150347 0.115976 0.121305 0.065636 0.091002 0.083147 0.078605 0.085200 0.088500 0.086582 0.109067 0.124716 0.110714
qa: -0.0857 -0.3933 -0.3133 -0.2460 -0.4281 -0.4011 -0.2202 -0.2557 0.1211 -0.0015 0.0878 0.2092 -0.2694 -0.2751 -0.1452 0.0695 0.4468 -0.1667 -0.1257 0.3675 -0.1567 -0.1969 0.1510 0.1278 -0.2382 -0.2533 -0.1273 0.1056 0.0482 0.0985 0.1695 0.0806 0.0798 0.1035 0.0962 0.0907 0.0725 0.1484 0.0970 0.1105 0.1068 0.1503 0.1160 0.1213 0.0656 0.0910 0.0831 0.0786 0.0852 0.0885 0.0866 0.1091 0.1247 0.1107
va: 1.2201 2.1367 2.0928 2.1461 2.0741 2.0861 3.1327 3.1281 3.7900 3.9026 3.9300 4.2151 3.9677 3.9382 3.8790 3.5381 4.3412 4.0501 3.9303 4.1362 4.0603 4.1131 3.8777 3.8725 3.9403 3.8909 3.8905 1.0347 1.0142 1.0187 1.0626 1.0019 1.0078 1.0173 1.0077 1.0091 1.0124 1.0422 1.0267 1.0178 1.0098 1.0084 1.0149 1.0144 1.0214 1.0106 1.0080 1.0085 1.0151 1.0092 1.0204 0.9926 0.9960 0.9942
dispcorr: -0.032189364 hartree
energy: -1686.365430145777
dipole: 39.13458 -37.57615 1.55843 -0.61231 0.74862 0.13632 1.88229 -0.12875 1.75354
magnitude: 2.34993 au
magnitude: 5.97305 debye
