program: Orca
programVersion: 5.0.2
elementType: Cl O O O O O N N C C C C C C C C C C C C C C C C C C C H H H H H H H H H H H H H H H H H H H H H H H H H H H
charge: 0
multiplicity: 1
keywords: wb97x-d3
keywords: def2-TZVPP
keywords: def2/J RIJCOSX
keywords: DEFGRID2
keywords: scfconv7
keywords: smallprint printgap noloewdin
keywords: NOSOSCF
formula: C19H27ClN2O5
InChI: InChI=1/C19H27ClN2O5/c1-11(2)17(22-19(25)27-12(3)4)18(24)21-15(10-16(23)26-5)13-6-8-14(20)9-7-13/h6-9,11-12,15,17,21-22H,10H2,1-5H3
54 atoms
Cl -5.513854 1.428402 -0.174239
O  0.049615 -2.40502 -2.12341
O  2.907266 1.989564 -0.543195
O  -0.821804 -0.153501 3.473051
O  1.124783 1.51002 -1.847538
O  1.052585 0.087277 2.288968
N  0.627074 -1.443613 -0.163537
N  2.663135 -0.067924 -1.312579
C  2.072673 -1.124915 -2.103275
C  3.128451 -2.221253 -2.354152
C  -0.532043 -1.886861 0.56449
C  0.804906 -1.712732 -1.474871
C  2.739683 -3.154846 -3.494448
C  3.464824 -3.019203 -1.095826
C  -0.200351 -1.944286 2.068254
C  -1.771333 -1.040592 0.331613
C  2.142959 1.185116 -1.284094
C  -3.00646 -1.51976 0.757568
C  -1.716566 0.211106 -0.264025
C  0.093827 -0.569241 2.614336
C  -4.159913 -0.770414 0.609542
C  -2.864628 0.974995 -0.420637
C  2.429805 3.319431 -0.28089
C  -4.079015 0.482551 0.0215
C  3.647137 4.127388 0.122038
C  1.366819 3.298956 0.803509
C  -0.681495 1.170687 3.977254
H  1.764366 -0.716943 -3.069803
H  4.03093 -1.684712 -2.670609
H  -0.757941 -2.907795 0.244004
H  1.266069 -0.816215 0.299406
H  1.878881 -3.770439 -3.241754
H  3.572539 -3.818084 -3.731466
H  2.491673 -2.598738 -4.398646
H  4.303008 -3.689327 -1.28754
H  2.621729 -3.63588 -0.781219
H  3.745836 -2.391629 -0.247507
H  3.558169 -0.219098 -0.877413
H  -1.030979 -2.399382 2.604939
H  0.680673 -2.573926 2.21362
H  -3.079388 -2.50348 1.20775
H  -0.782704 0.601619 -0.643095
H  -5.11353 -1.157795 0.940349
H  -2.808494 1.943985 -0.89697
H  2.004618 3.731338 -1.199724
H  4.400098 4.133982 -0.665826
H  4.102877 3.730574 1.030158
H  3.35882 5.160172 0.316449
H  1.753203 2.860398 1.723769
H  1.043272 4.318181 1.018253
H  0.488628 2.732854 0.496549
H  -0.709742 1.904778 3.171988
H  -1.527512 1.327217 4.640007
H  0.247574 1.291883 4.534243
totalener: -1686.33295409 hartree
nucrepener: 2867.37539365 hartree
electener: -4553.70834775 hartree
oneelecener: -8010.44600576 hartree
twoeener: 3456.73765802 hartree
kineticenergy: 1680.39213261 hartree
xcener: -138.347328086120 hartree
chargesum: -0.0000000
charge: -0.085234 -0.391858 -0.312448 -0.244996 -0.426716 -0.399171 -0.220919 -0.255712 0.122197 -0.001563 0.080897 0.212117 -0.268822 -0.277196 -0.149026 0.046722 0.440615 -0.156689 -0.105789 0.366550 -0.159793 -0.206323 0.156844 0.134558 -0.239398 -0.258823 -0.127387 0.107070 0.050095 0.100394 0.169255 0.100392 0.081933 0.080971 0.097533 0.088937 0.072601 0.149294 0.097625 0.111490 0.105437 0.152824 0.115670 0.120913 0.067236 0.091486 0.083748 0.078048 0.084213 0.090184 0.085578 0.107450 0.124826 0.112155
qa: -0.0852 -0.3919 -0.3124 -0.2450 -0.4267 -0.3992 -0.2209 -0.2557 0.1222 -0.0016 0.0809 0.2121 -0.2688 -0.2772 -0.1490 0.0467 0.4406 -0.1567 -0.1058 0.3666 -0.1598 -0.2063 0.1568 0.1346 -0.2394 -0.2588 -0.1274 0.1071 0.0501 0.1004 0.1693 0.1004 0.0819 0.0810 0.0975 0.0889 0.0726 0.1493 0.0976 0.1115 0.1054 0.1528 0.1157 0.1209 0.0672 0.0915 0.0837 0.0780 0.0842 0.0902 0.0856 0.1074 0.1248 0.1122
va: 1.2204 2.1391 2.0940 2.1451 2.0758 2.0879 3.1269 3.1332 3.7965 3.9027 3.9248 4.2079 3.9693 3.9410 3.8779 3.5777 4.3511 4.0378 3.9076 4.1383 4.0633 4.1275 3.8694 3.8657 3.9415 3.8906 3.8906 1.0344 1.0134 1.0213 1.0612 1.0163 1.0015 1.0084 1.0080 1.0091 1.0125 1.0415 1.0263 1.0192 1.0100 1.0030 1.0150 1.0161 1.0215 1.0104 1.0080 1.0084 1.0155 1.0096 1.0198 0.9918 0.9966 0.9939
dispcorr: -0.032672414 hartree
energy: -1686.365626506960
dipole: 37.88650 -36.39623 1.49027 -2.64753 2.70007 0.05254 1.95424 -0.15125 1.80298
magnitude: 2.33974 au
magnitude: 5.94715 debye
