program: Orca
programVersion: 5.0.2
elementType: Cl O O O O O N N C C C C C C C C C C C C C C C C C C C H H H H H H H H H H H H H H H H H H H H H H H H H H H
charge: 0
multiplicity: 1
keywords: wb97x-d3
keywords: def2-TZVPP
keywords: def2/J RIJCOSX
keywords: DEFGRID2
keywords: scfconv7
keywords: smallprint printgap noloewdin
keywords: NOSOSCF
formula: C19H27ClN2O5
InChI: InChI=1/C19H27ClN2O5/c1-11(2)17(22-19(25)27-12(3)4)18(24)21-15(10-16(23)26-5)13-6-8-14(20)9-7-13/h6-9,11-12,15,17,21-22H,10H2,1-5H3
54 atoms
Cl -2.795819 3.677401 1.186387
O  2.209748 -1.406819 0.916872
O  1.240508 2.303454 -1.799884
O  -1.601514 -3.117168 3.548491
O  0.501579 0.358467 -2.675339
O  -2.754826 -3.131444 1.638653
N  0.540644 -1.822753 -0.577945
N  2.433987 0.47364 -1.481179
C  2.64298 -0.959558 -1.404197
C  4.124166 -1.298597 -1.250498
C  -0.62012 -1.874136 0.302085
C  1.790308 -1.447147 -0.223583
C  4.938513 -0.708774 -2.397554
C  4.315545 -2.8105 -1.184322
C  -0.393253 -2.671955 1.582721
C  -1.168379 -0.485553 0.565806
C  1.310629 0.997191 -2.038959
C  -0.482684 0.435761 1.354367
C  -2.370498 -0.097079 -0.011503
C  -1.719778 -2.987625 2.231153
C  -0.97951 1.714323 1.548485
C  -2.881029 1.178678 0.172638
C  0.034899 3.001102 -2.16275
C  -2.176741 2.078665 0.952966
C  0.027008 3.333682 -3.643067
C  -0.000516 4.242205 -1.294484
C  -2.783688 -3.442796 4.268025
H  2.287228 -1.394353 -2.342342
H  4.476233 -0.872273 -0.305166
H  -1.375628 -2.416563 -0.269181
H  0.297156 -1.623729 -1.537397
H  4.615053 -1.115614 -3.358244
H  5.995014 -0.950854 -2.278316
H  4.85322 0.375529 -2.456077
H  3.803704 -3.254105 -0.331517
H  5.373384 -3.056754 -1.090596
H  3.948338 -3.293616 -2.092809
H  2.921394 1.04178 -0.805748
H  0.095037 -3.620589 1.337062
H  0.263899 -2.163534 2.283376
H  0.452716 0.16263 1.82408
H  -2.9266 -0.80272 -0.615737
H  -0.44113 2.421235 2.164883
H  -3.818564 1.466282 -0.28261
H  -0.821595 2.364658 -1.922878
H  0.891829 3.942912 -3.910685
H  -0.869489 3.905507 -3.885654
H  0.025579 2.436614 -4.258752
H  0.834494 4.907335 -1.519286
H  -0.925247 4.790888 -1.469787
H  0.034215 3.987761 -0.236007
H  -3.553162 -2.681414 4.139293
H  -3.191599 -4.405575 3.959085
H  -2.493285 -3.491297 5.3139
totalener: -1686.33126887 hartree
nucrepener: 2858.34875574 hartree
electener: -4544.68002460 hartree
oneelecener: -7992.34222921 hartree
twoeener: 3447.66220460 hartree
kineticenergy: 1680.40601223 hartree
xcener: -138.345688228811 hartree
chargesum: -0.0000000
charge: -0.083544 -0.429723 -0.315094 -0.262086 -0.457242 -0.374487 -0.175158 -0.205834 0.070387 0.048414 0.169598 0.187847 -0.254116 -0.287794 -0.137722 -0.061256 0.461842 -0.149651 -0.103826 0.350599 -0.159385 -0.137815 0.163084 0.073470 -0.263078 -0.245786 -0.130168 0.093655 0.044985 0.103490 0.163484 0.076286 0.087321 0.086404 0.103336 0.084647 0.079734 0.144316 0.102969 0.112630 0.142930 0.105433 0.124534 0.119764 0.057638 0.083506 0.083477 0.106905 0.094555 0.084728 0.085057 0.110424 0.108107 0.118207
qa: -0.0835 -0.4297 -0.3151 -0.2621 -0.4572 -0.3745 -0.1752 -0.2058 0.0704 0.0484 0.1696 0.1878 -0.2541 -0.2878 -0.1377 -0.0613 0.4618 -0.1497 -0.1038 0.3506 -0.1594 -0.1378 0.1631 0.0735 -0.2631 -0.2458 -0.1302 0.0937 0.0450 0.1035 0.1635 0.0763 0.0873 0.0864 0.1033 0.0846 0.0797 0.1443 0.1030 0.1126 0.1429 0.1054 0.1245 0.1198 0.0576 0.0835 0.0835 0.1069 0.0946 0.0847 0.0851 0.1104 0.1081 0.1182
va: 1.2212 2.0711 2.0898 2.1381 2.0351 2.1222 3.1799 3.1436 3.8915 3.8765 3.8227 4.2306 3.9350 3.9538 3.8607 3.6101 4.3352 3.9120 4.0306 4.1579 4.0025 3.9902 3.8206 3.8512 3.9275 3.9227 3.9001 1.0277 1.0370 1.0323 1.0404 1.0057 1.0072 1.0184 1.0154 1.0055 1.0059 1.0446 1.0181 1.0366 1.0228 1.0157 1.0128 1.0142 1.0194 1.0091 1.0082 1.0185 1.0124 1.0115 1.0143 0.9946 0.9947 0.9945
dispcorr: -0.032876642 hartree
energy: -1686.364145507819
dipole: 23.21251 -22.86464 0.34787 -8.54730 8.49581 -0.05149 -14.27811 14.28490 0.00679
magnitude: 0.35173 au
magnitude: 0.89402 debye
