program: Orca
programVersion: 5.0.2
elementType: Cl O O O O O N N C C C C C C C C C C C C C C C C C C C H H H H H H H H H H H H H H H H H H H H H H H H H H H
charge: 0
multiplicity: 1
keywords: wb97x-d3
keywords: def2-TZVPP
keywords: def2/J RIJCOSX
keywords: DEFGRID2
keywords: scfconv7
keywords: smallprint printgap noloewdin
keywords: NOSOSCF
formula: C19H27ClN2O5
InChI: InChI=1/C19H27ClN2O5/c1-11(2)17(22-19(25)27-12(3)4)18(24)21-15(10-16(23)26-5)13-6-8-14(20)9-7-13/h6-9,11-12,15,17,21-22H,10H2,1-5H3
54 atoms
Cl -2.554052 3.744213 1.494358
O  2.08738 -1.589509 0.935572
O  1.375036 2.343082 -1.627125
O  -1.928466 -3.430397 3.172949
O  0.653475 0.468078 -2.653854
O  -3.013731 -3.005846 1.269544
N  0.486989 -1.787841 -0.674407
N  2.497094 0.465802 -1.321193
C  2.672606 -0.974503 -1.31544
C  4.132215 -1.360444 -1.084306
C  -0.720832 -1.838296 0.141088
C  1.732714 -1.511596 -0.224586
C  5.044802 -0.699988 -2.112602
C  4.288349 -2.877328 -1.133712
C  -0.61637 -2.776878 1.338913
C  -1.184885 -0.445939 0.520979
C  1.43084 1.04991 -1.928302
C  -2.310974 0.095356 -0.086688
C  -0.493114 0.332623 1.446489
C  -1.989866 -3.067881 1.894934
C  -2.742228 1.380375 0.20419
C  -0.909529 1.619454 1.746299
C  0.220339 3.093073 -2.048013
C  -2.033047 2.136779 1.121218
C  0.343416 3.50166 -3.503931
C  0.14273 4.2884 -1.121011
C  -3.159039 -3.761233 3.803288
H  2.37062 -1.345079 -2.298974
H  4.420959 -1.024514 -0.082885
H  -1.480219 -2.262636 -0.518375
H  0.308995 -1.494611 -1.624655
H  4.998159 0.3876 -2.076962
H  4.782221 -1.006632 -3.127456
H  6.081623 -0.990825 -1.940829
H  3.699815 -3.378432 -0.366649
H  5.329984 -3.15826 -0.977125
H  3.98789 -3.271453 -2.107399
H  2.94974 0.983836 -0.584016
H  -0.175562 -3.726543 1.018389
H  0.035348 -2.391082 2.119104
H  -2.872344 -0.498188 -0.797296
H  0.385137 -0.058876 1.941692
H  -3.624002 1.78442 -0.273814
H  -0.365707 2.214855 2.466863
H  -0.667888 2.469905 -1.911943
H  1.239768 4.102681 -3.665265
H  -0.517719 4.10731 -3.788802
H  0.375991 2.6385 -4.165484
H  1.007394 4.942321 -1.243611
H  -0.752029 4.869826 -1.341212
H  0.085503 3.980486 -0.078019
H  -3.854553 -2.921929 3.790503
H  -3.638288 -4.617423 3.327374
H  -2.911053 -4.010778 4.831252
totalener: -1686.33168512 hartree
nucrepener: 2855.59206125 hartree
electener: -4541.92374637 hartree
oneelecener: -7986.84728380 hartree
twoeener: 3444.92353743 hartree
kineticenergy: 1680.39557795 hartree
xcener: -138.344168428126 hartree
chargesum: -0.0000000
charge: -0.084476 -0.429442 -0.314057 -0.263562 -0.460922 -0.373164 -0.183330 -0.204567 0.069953 0.048621 0.177026 0.189864 -0.253834 -0.288325 -0.146003 -0.051541 0.464295 -0.110833 -0.156958 0.354617 -0.144505 -0.140133 0.159178 0.066967 -0.262489 -0.234464 -0.129792 0.096042 0.045406 0.101601 0.167766 0.085064 0.077007 0.087388 0.103870 0.084455 0.079497 0.143944 0.102691 0.113911 0.103584 0.143171 0.119883 0.123095 0.057090 0.083482 0.083164 0.106469 0.092255 0.085289 0.080052 0.110374 0.107350 0.117977
qa: -0.0845 -0.4294 -0.3141 -0.2636 -0.4609 -0.3732 -0.1833 -0.2046 0.0700 0.0486 0.1770 0.1899 -0.2538 -0.2883 -0.1460 -0.0515 0.4643 -0.1108 -0.1570 0.3546 -0.1445 -0.1401 0.1592 0.0670 -0.2625 -0.2345 -0.1298 0.0960 0.0454 0.1016 0.1678 0.0851 0.0770 0.0874 0.1039 0.0845 0.0795 0.1439 0.1027 0.1139 0.1036 0.1432 0.1199 0.1231 0.0571 0.0835 0.0832 0.1065 0.0923 0.0853 0.0801 0.1104 0.1074 0.1180
va: 1.2192 2.0697 2.0934 2.1368 2.0312 2.1241 3.1769 3.1449 3.8841 3.8781 3.8202 4.2342 3.9353 3.9531 3.8596 3.5929 4.3327 4.0248 3.9230 4.1551 3.9838 4.0039 3.8261 3.8597 3.9251 3.9255 3.9007 1.0280 1.0370 1.0316 1.0411 1.0181 1.0059 1.0071 1.0154 1.0056 1.0056 1.0444 1.0192 1.0364 1.0161 1.0230 1.0138 1.0133 1.0201 1.0090 1.0084 1.0185 1.0119 1.0112 1.0171 0.9946 0.9948 0.9943
dispcorr: -0.032670057 hartree
energy: -1686.364355179291
dipole: 22.98234 -22.64038 0.34195 -8.87656 8.77817 -0.09839 -14.69585 14.67201 -0.02384
magnitude: 0.35663 au
magnitude: 0.90647 debye
