program: Orca
programVersion: 5.0.2
elementType: Cl O O O O O N N C C C C C C C C C C C C C C C C C C C H H H H H H H H H H H H H H H H H H H H H H H H H H H
charge: 0
multiplicity: 1
keywords: wb97x-d3
keywords: def2-TZVPP
keywords: def2/J RIJCOSX
keywords: DEFGRID2
keywords: scfconv7
keywords: smallprint printgap noloewdin
keywords: NOSOSCF
formula: C19H27ClN2O5
InChI: InChI=1/C19H27ClN2O5/c1-11(2)17(22-19(25)27-12(3)4)18(24)21-15(10-16(23)26-5)13-6-8-14(20)9-7-13/h6-9,11-12,15,17,21-22H,10H2,1-5H3
54 atoms
Cl -5.562433 1.365545 -0.157198
O  0.01178 -2.640438 -1.933286
O  3.081822 1.776235 -0.442934
O  -0.899742 -0.180468 3.63728
O  1.244745 1.510928 -1.741288
O  0.880518 0.133668 2.332325
N  0.554717 -1.537657 -0.036357
N  2.610051 -0.227064 -1.233825
C  1.918711 -1.204788 -2.037793
C  2.88112 -2.2762 -2.574239
C  -0.604784 -1.951611 0.707341
C  0.727708 -1.866423 -1.334332
C  3.532101 -3.099266 -1.465637
C  3.928837 -1.664059 -3.497088
C  -0.285878 -1.957681 2.213492
C  -1.837269 -1.10732 0.437396
C  2.227522 1.076669 -1.188041
C  -1.76299 0.153264 -0.138942
C  -3.084775 -1.592522 0.817029
C  -0.023807 -0.562977 2.723978
C  -2.906528 0.917205 -0.324556
C  -4.233512 -0.84239 0.640273
C  2.825671 3.159487 -0.141321
C  -4.134569 0.417667 0.070531
C  1.542583 3.361583 0.647879
C  2.918826 4.048842 -1.369015
C  -0.773474 1.146146 4.138723
H  1.484557 -0.686932 -2.897493
H  2.258698 -2.951042 -3.165669
H  -0.831826 -2.981394 0.41971
H  1.155169 -0.840984 0.375788
H  2.794991 -3.558165 -0.80624
H  4.214181 -2.509676 -0.84675
H  4.127813 -3.905077 -1.894922
H  3.46553 -1.09662 -4.305261
H  4.542274 -2.443312 -3.950542
H  4.60174 -0.988775 -2.965499
H  3.458456 -0.488731 -0.759973
H  -1.1121 -2.412871 2.75716
H  0.605226 -2.566401 2.386354
H  -0.816234 0.553376 -0.476297
H  -3.169525 -2.58235 1.251439
H  -2.836242 1.893448 -0.783861
H  -5.197152 -1.23496 0.933739
H  3.665455 3.397629 0.514727
H  0.656537 3.269893 0.023481
H  1.54828 4.364243 1.077715
H  1.467007 2.647929 1.468294
H  2.074437 3.911368 -2.040582
H  2.933291 5.092545 -1.051989
H  3.839668 3.863151 -1.922611
H  0.187027 1.298712 4.630905
H  -0.883694 1.881921 3.342256
H  -1.576337 1.268976 4.859662
totalener: -1686.33188504 hartree
nucrepener: 2853.15111205 hartree
electener: -4539.48299709 hartree
oneelecener: -7982.00752608 hartree
twoeener: 3442.52452899 hartree
kineticenergy: 1680.39648010 hartree
xcener: -138.350021524177 hartree
chargesum: 0.0000000
charge: -0.083917 -0.397243 -0.319548 -0.247202 -0.436644 -0.406656 -0.231659 -0.284760 0.128506 0.030060 0.106365 0.194989 -0.286178 -0.269583 -0.141173 0.065646 0.463753 -0.120433 -0.170177 0.376404 -0.195367 -0.152069 0.177401 0.125087 -0.292168 -0.277287 -0.129276 0.110532 0.059969 0.101472 0.172073 0.098320 0.060990 0.094085 0.091765 0.090583 0.071236 0.158794 0.095966 0.108946 0.135101 0.106927 0.121292 0.116432 0.072151 0.097638 0.088862 0.094688 0.106475 0.084082 0.087734 0.111664 0.110730 0.124621
qa: -0.0839 -0.3972 -0.3195 -0.2472 -0.4366 -0.4067 -0.2317 -0.2848 0.1285 0.0301 0.1064 0.1950 -0.2862 -0.2696 -0.1412 0.0656 0.4638 -0.1204 -0.1702 0.3764 -0.1954 -0.1521 0.1774 0.1251 -0.2922 -0.2773 -0.1293 0.1105 0.0600 0.1015 0.1721 0.0983 0.0610 0.0941 0.0918 0.0906 0.0712 0.1588 0.0960 0.1089 0.1351 0.1069 0.1213 0.1164 0.0722 0.0976 0.0889 0.0947 0.1065 0.0841 0.0877 0.1117 0.1107 0.1246
va: 1.2220 2.1382 2.0871 2.1484 2.0674 2.0817 3.1252 3.1309 3.7831 3.8397 3.9054 4.2999 3.9475 3.9424 3.8731 3.5663 4.3096 3.9457 4.0502 4.1254 4.1111 4.0546 3.8933 3.8760 3.9097 3.9154 3.8879 1.0347 1.0356 1.0240 1.0606 1.0117 1.0065 1.0067 1.0073 1.0068 1.0113 1.0419 1.0263 1.0200 1.0137 1.0104 1.0142 1.0148 0.9943 1.0129 1.0087 1.0199 1.0170 1.0064 1.0098 0.9944 0.9929 0.9958
dispcorr: -0.032018750 hartree
energy: -1686.363903790674
dipole: 39.18482 -37.81923 1.36559 0.87034 -0.77253 0.09781 -2.29026 4.06375 1.77349
magnitude: 2.24046 au
magnitude: 5.69480 debye
