program: Orca
programVersion: 5.0.2
elementType: Cl O O O O O N N C C C C C C C C C C C C C C C C C C C H H H H H H H H H H H H H H H H H H H H H H H H H H H
charge: 0
multiplicity: 1
keywords: wb97x-d3
keywords: def2-TZVPP
keywords: def2/J RIJCOSX
keywords: DEFGRID2
keywords: scfconv7
keywords: smallprint printgap noloewdin
keywords: NOSOSCF
formula: C19H27ClN2O5
InChI: InChI=1/C19H27ClN2O5/c1-11(2)17(22-19(25)27-12(3)4)18(24)21-15(10-16(23)26-5)13-6-8-14(20)9-7-13/h6-9,11-12,15,17,21-22H,10H2,1-5H3
54 atoms
Cl -4.295954 2.945567 0.669995
O  0.55505 -1.496389 -2.474278
O  1.411739 1.525523 -1.404137
O  -1.457049 -2.189816 3.388243
O  2.360333 2.148625 0.549985
O  0.610168 -1.714298 2.702148
N  0.681113 -1.539898 -0.215914
N  2.8687 0.172519 -0.44584
C  2.633049 -0.821932 -1.469458
C  3.616547 -1.990477 -1.285708
C  -0.708515 -1.850974 -0.008065
C  1.1780 -1.301867 -1.454479
C  5.052421 -1.522721 -1.515521
C  3.290319 -3.154786 -2.21571
C  -0.89444 -2.80483 1.183469
C  -1.578104 -0.618103 0.144538
C  2.220423 1.366558 -0.358678
C  -2.848587 -0.60055 -0.417611
C  -1.158528 0.495607 0.865605
C  -0.483436 -2.178953 2.492656
C  -3.691609 0.487989 -0.262219
C  -1.991009 1.590589 1.034544
C  0.573365 2.69091 -1.466503
C  -3.256172 1.57983 0.470105
C  -0.602404 2.315931 -2.345148
C  1.358222 3.873271 -2.004094
C  -1.190343 -1.57064 4.642149
H  2.794656 -0.39622 -2.464394
H  3.526047 -2.349288 -0.252207
H  -1.046088 -2.388889 -0.89587
H  1.234451 -1.300574 0.591991
H  5.18265 -1.170868 -2.540792
H  5.752004 -2.344001 -1.357392
H  5.351972 -0.71098 -0.852349
H  3.263436 -2.834946 -3.258284
H  2.329859 -3.614638 -1.989157
H  4.052773 -3.928673 -2.124404
H  3.530081 -0.012856 0.289375
H  -1.935061 -3.124027 1.225205
H  -0.278028 -3.693026 1.020196
H  -3.187328 -1.44706 -1.003305
H  -0.168627 0.536299 1.301554
H  -4.673794 0.490769 -0.714091
H  -1.650282 2.449736 1.596039
H  0.217047 2.921014 -0.459387
H  -0.279473 2.071384 -3.357806
H  -1.298751 3.152485 -2.402726
H  -1.139462 1.457229 -1.9439
H  2.190638 4.131016 -1.351205
H  1.744934 3.665702 -3.002975
H  0.708928 4.746752 -2.072703
H  -0.370713 -2.061636 5.166592
H  -0.947264 -0.515368 4.518225
H  -2.104072 -1.666895 5.221286
totalener: -1686.33036912 hartree
nucrepener: 2910.45796072 hartree
electener: -4596.78832984 hartree
oneelecener: -8096.29579237 hartree
twoeener: 3499.50746253 hartree
kineticenergy: 1680.39953372 hartree
xcener: -138.347856421423 hartree
chargesum: 0.0000000
charge: -0.077522 -0.384608 -0.277418 -0.250449 -0.404905 -0.391894 -0.201192 -0.252383 0.073936 -0.000807 0.103324 0.222425 -0.251363 -0.272270 -0.102045 0.131991 0.401023 -0.179944 -0.271522 0.345382 -0.116831 -0.184683 0.118456 0.099582 -0.226176 -0.258978 -0.122179 0.099258 0.044642 0.095443 0.160571 0.083098 0.087398 0.081018 0.095969 0.093028 0.082201 0.151097 0.093803 0.103966 0.110823 0.146045 0.119064 0.135238 0.061928 0.097281 0.088211 0.086455 0.104144 0.083652 0.082386 0.111329 0.111823 0.121180
qa: -0.0775 -0.3846 -0.2774 -0.2504 -0.4049 -0.3919 -0.2012 -0.2524 0.0739 -0.0008 0.1033 0.2224 -0.2514 -0.2723 -0.1020 0.1320 0.4010 -0.1799 -0.2715 0.3454 -0.1168 -0.1847 0.1185 0.0996 -0.2262 -0.2590 -0.1222 0.0993 0.0446 0.0954 0.1606 0.0831 0.0874 0.0810 0.0960 0.0930 0.0822 0.1511 0.0938 0.1040 0.1108 0.1460 0.1191 0.1352 0.0619 0.0973 0.0882 0.0865 0.1041 0.0837 0.0824 0.1113 0.1118 0.1212
va: 1.2278 2.1379 2.0861 2.1453 2.1040 2.0892 3.1143 3.1012 3.8049 3.8875 3.9123 4.1813 3.9364 3.9661 3.8957 3.4937 4.4021 4.0644 3.9628 4.1515 4.0102 4.0198 3.8353 3.8975 3.9018 3.9373 3.8854 1.0302 1.0196 1.0416 1.0630 1.0058 1.0075 1.0158 1.0088 1.0123 1.0031 1.0380 1.0287 1.0150 1.0113 1.0238 1.0147 1.0111 1.0240 1.0148 1.0065 1.0191 1.0168 1.0084 1.0093 0.9957 0.9951 0.9936
dispcorr: -0.034580859 hartree
energy: -1686.364949982150
dipole: 27.57030 -27.65220 -0.08190 -11.51972 10.29004 -1.22968 -11.27463 11.97321 0.69858
magnitude: 1.41663 au
magnitude: 3.60078 debye
