program: Orca
programVersion: 5.0.2
elementType: Cl O O N N C C C C C C C C C C C C C C C C C C C C C C H H H H H H H H H H H H H H H H H H H H H H H H H
charge: 0
multiplicity: 1
keywords: wb97x-d3
keywords: def2-TZVPP
keywords: def2/J RIJCOSX
keywords: DEFGRID2
keywords: scfconv7
keywords: smallprint printgap noloewdin
keywords: NOSOSCF
formula: C22H25ClN2O2
InChI: InChI=1/C22H25ClN2O2/c1-22(2,3)18-6-4-16(5-7-18)19(17-8-9-24-20(23)14-17)15-21(26)25-10-12-27-13-11-25/h4-9,14-15H,10-13H2,1-3H3
52 atoms
Cl -0.410047 -3.932252 -2.922942
O  -4.971932 1.96888 2.436266
O  -2.70843 1.173101 -1.529925
N  -3.104346 2.35987 0.357723
N  -1.984413 -3.34046 -0.938731
C  5.616856 0.38467 0.675592
C  4.110045 0.434644 0.456652
C  5.909624 0.228703 2.172635
C  6.317057 1.647769 0.177881
C  6.192077 -0.818063 -0.08274
C  -2.758662 2.67957 1.734331
C  -4.533407 2.468907 0.110194
C  3.30936 -0.632973 0.871579
C  3.469822 1.502988 -0.167263
C  -3.587841 1.83339 2.685285
C  -5.294153 1.613597 1.105988
C  1.306608 0.438573 0.043845
C  -0.153572 0.439417 -0.16633
C  1.941544 -0.638422 0.666478
C  2.09746 1.506605 -0.371766
C  -2.308863 1.659194 -0.473039
C  -0.871513 1.567767 -0.096825
C  -0.794759 -0.869294 -0.431507
C  -0.321247 -1.694615 -1.443645
C  -1.865742 -1.32219 0.334009
C  -0.969327 -2.901242 -1.644076
C  -2.420477 -2.552874 0.041554
H  6.987361 0.190604 2.343944
H  5.481611 -0.686659 2.583211
H  5.511937 1.069526 2.743816
H  6.183592 1.798381 -0.894837
H  7.389378 1.568254 0.363188
H  5.96367 2.543722 0.691558
H  5.770314 -1.76148 0.266508
H  7.274008 -0.870719 0.055327
H  5.996502 -0.740704 -1.153799
H  -1.703352 2.498574 1.92617
H  -2.948497 3.741257 1.910082
H  -4.825666 3.516956 0.21637
H  -4.768794 2.162341 -0.905232
H  3.757121 -1.487533 1.36372
H  4.037016 2.353151 -0.520263
H  -3.406659 2.15238 3.712567
H  -3.282261 0.781514 2.598736
H  -5.072426 0.552714 0.924665
H  -6.367496 1.760189 0.979517
H  1.363862 -1.487798 1.009282
H  1.646419 2.345929 -0.886389
H  -0.378669 2.492314 0.183827
H  0.514882 -1.401213 -2.063377
H  -2.257288 -0.73401 1.153433
H  -3.251328 -2.929371 0.624683
elementType: Cl O N C H
totalener: -1573.66808871 hartree
nucrepener: 2557.03019218 hartree
electener: -4130.69828089 hartree
oneelecener: -7230.54940786 hartree
twoeener: 3099.85112697 hartree
cpcmener: -0.04772641 hartree
kineticenergy: 1568.01357674 hartree
xcener: -130.925182552216 hartree
chargesum: -0.0000000
charge: -0.087941 -0.395829 -0.555069 -0.081480 -0.329330 0.327084 -0.093432 -0.330289 -0.357402 -0.329268 -0.062521 -0.063360 -0.180525 -0.157745 0.005231 0.022346 -0.009337 0.186718 -0.213416 -0.176113 0.277928 -0.188485 -0.016683 -0.187211 -0.147932 0.191655 0.014618 0.097688 0.097329 0.102870 0.100594 0.100895 0.102816 0.098064 0.097526 0.102899 0.115137 0.108381 0.107820 0.094725 0.143248 0.147925 0.107235 0.095617 0.087294 0.106431 0.157879 0.148425 0.152680 0.145309 0.167442 0.151560
qa: -0.0879 -0.3958 -0.5551 -0.0815 -0.3293 0.3271 -0.0934 -0.3303 -0.3574 -0.3293 -0.0625 -0.0634 -0.1805 -0.1577 0.0052 0.0223 -0.0093 0.1867 -0.2134 -0.1761 0.2779 -0.1885 -0.0167 -0.1872 -0.1479 0.1917 0.0146 0.0977 0.0973 0.1029 0.1006 0.1009 0.1028 0.0981 0.0975 0.1029 0.1151 0.1084 0.1078 0.0947 0.1432 0.1479 0.1072 0.0956 0.0873 0.1064 0.1579 0.1484 0.1527 0.1453 0.1674 0.1516
va: 1.2153 1.9151 1.9373 3.1596 3.0443 3.6439 3.7777 3.9179 3.9268 3.9179 3.8627 3.8354 4.0013 3.9137 3.9330 3.9340 3.5660 3.4101 3.9940 4.0120 4.2220 3.7626 3.6177 3.9712 3.8893 4.1646 4.0458 1.0031 1.0043 1.0031 1.0008 1.0067 1.0005 1.0036 1.0033 1.0034 1.0074 1.0084 1.0079 1.0434 1.0031 0.9988 1.0004 1.0003 1.0030 0.9985 0.9924 1.0028 1.0002 1.0106 0.9876 1.0002
dispcorr: -0.027493559 hartree
energy: -1573.695582264580
dipole: 28.53797 -27.11149 1.42648 23.51754 -21.25084 2.26669 22.16885 -19.56020 2.60865
magnitude: 3.73869 au
magnitude: 9.50300 debye
