program: Orca
programVersion: 5.0.2
elementType: Cl O O N N C C C C C C C C C C C C C C C C C C C C C C H H H H H H H H H H H H H H H H H H H H H H H H H
charge: 0
multiplicity: 1
keywords: wb97x-d3
keywords: def2-TZVPP
keywords: def2/J RIJCOSX
keywords: DEFGRID2
keywords: scfconv7
keywords: smallprint printgap noloewdin
keywords: NOSOSCF
formula: C22H25ClN2O2
InChI: InChI=1/C22H25ClN2O2/c1-22(2,3)18-6-4-16(5-7-18)19(17-8-9-24-20(23)14-17)15-21(26)25-10-12-27-13-11-25/h4-9,14-15H,10-13H2,1-3H3
52 atoms
Cl -3.093226 -3.840937 0.192858
O  -4.793672 2.519634 -0.77058
O  -2.247114 0.495638 2.812316
N  -2.845874 1.118975 0.721161
N  -1.840654 -2.784161 -1.828033
C  5.947262 0.73173 -0.250014
C  4.442239 0.613003 -0.0429
C  6.674705 -0.048237 0.851801
C  6.425413 2.181829 -0.209285
C  6.314921 0.14313 -1.617493
C  -2.552881 1.590468 -0.621314
C  -4.264607 0.888407 0.943524
C  3.616794 1.715828 0.16297
C  3.832213 -0.644426 -0.069171
C  -3.419029 2.79567 -0.943769
C  -5.06406 2.117172 0.557306
C  1.647406 0.317923 0.30767
C  0.192934 0.15706 0.504986
C  2.246815 1.573766 0.333362
C  2.466625 -0.792663 0.094607
C  -1.939947 0.830531 1.666995
C  -0.490083 0.944312 1.344995
C  -0.487762 -0.889299 -0.289168
C  -1.354455 -1.801144 0.299672
C  -0.293314 -0.970053 -1.668069
C  -1.997147 -2.706434 -0.529326
C  -0.990728 -1.92144 -2.384432
H  7.755763 0.020024 0.71214
H  6.410837 -1.106764 0.848623
H  6.44155 0.351695 1.840496
H  5.963322 2.78949 -0.989433
H  7.504535 2.215933 -0.367544
H  6.223305 2.656429 0.752666
H  7.391083 0.220377 -1.785314
H  5.812784 0.677923 -2.425746
H  6.046473 -0.911112 -1.697643
H  -1.508429 1.880578 -0.708826
H  -2.744091 0.788111 -1.341398
H  -4.579233 0.02916 0.341488
H  -4.449552 0.646703 1.986847
H  4.02917 2.715068 0.181648
H  4.430802 -1.533744 -0.22326
H  -3.269984 3.077193 -1.987212
H  -3.114582 3.645808 -0.318109
H  -4.8495 2.934792 1.258824
H  -6.129382 1.892053 0.621283
H  1.639125 2.460414 0.464707
H  2.039052 -1.78741 0.069702
H  0.042239 1.668778 1.952131
H  -1.516544 -1.820878 1.368267
H  0.374899 -0.291741 -2.180703
H  -0.868097 -1.995411 -3.457632
elementType: Cl O N C H
totalener: -1573.66682337 hartree
nucrepener: 2585.44679908 hartree
electener: -4159.11362245 hartree
oneelecener: -7286.60623612 hartree
twoeener: 3127.49261368 hartree
cpcmener: -0.04337662 hartree
kineticenergy: 1568.00261463 hartree
xcener: -130.924582962295 hartree
chargesum: 0.0000000
charge: -0.087096 -0.396203 -0.565406 -0.067969 -0.324157 0.330130 -0.095974 -0.330611 -0.359622 -0.328949 -0.081065 -0.050313 -0.166884 -0.181187 0.007859 0.020827 0.004192 0.129525 -0.181039 -0.209811 0.279606 -0.104323 0.024820 -0.197459 -0.176229 0.196457 0.023434 0.097567 0.097862 0.102803 0.102175 0.101108 0.101779 0.097363 0.102548 0.097817 0.124442 0.105183 0.098763 0.098148 0.146983 0.144551 0.104977 0.089170 0.085407 0.103238 0.149855 0.155028 0.134518 0.137911 0.155385 0.152865
qa: -0.0871 -0.3962 -0.5654 -0.0680 -0.3242 0.3301 -0.0960 -0.3306 -0.3596 -0.3289 -0.0811 -0.0503 -0.1669 -0.1812 0.0079 0.0208 0.0042 0.1295 -0.1810 -0.2098 0.2796 -0.1043 0.0248 -0.1975 -0.1762 0.1965 0.0234 0.0976 0.0979 0.1028 0.1022 0.1011 0.1018 0.0974 0.1025 0.0978 0.1244 0.1052 0.0988 0.0981 0.1470 0.1446 0.1050 0.0892 0.0854 0.1032 0.1499 0.1550 0.1345 0.1379 0.1554 0.1529
va: 1.2151 1.9202 1.9218 3.1250 3.0433 3.6378 3.7785 3.9182 3.9274 3.9178 3.8447 3.8174 3.9237 3.9955 3.9852 3.9665 3.5225 3.4034 4.0169 3.9979 4.1681 3.8349 3.5990 3.9377 3.9088 4.1708 4.0267 1.0031 1.0038 1.0032 1.0006 1.0065 1.0005 1.0033 1.0031 1.0041 0.9996 1.0000 1.0100 1.0426 0.9992 1.0023 0.9964 1.0059 1.0042 0.9968 1.0015 0.9949 1.0121 1.0369 0.9975 0.9987
dispcorr: -0.028790825 hartree
energy: -1573.695614190915
dipole: 40.50289 -38.34642 2.15647 25.55459 -23.54295 2.01164 -5.01438 3.43652 -1.57786
magnitude: 3.34465 au
magnitude: 8.50143 debye
