program: Orca
programVersion: 5.0.2
elementType: Cl O O N N C C C C C C C C C C C C C C C C C C C C C C H H H H H H H H H H H H H H H H H H H H H H H H H
charge: 0
multiplicity: 1
keywords: wb97x-d3
keywords: def2-TZVPP
keywords: def2/J RIJCOSX
keywords: DEFGRID2
keywords: scfconv7
keywords: smallprint printgap noloewdin
keywords: NOSOSCF
formula: C22H25ClN2O2
InChI: InChI=1/C22H25ClN2O2/c1-22(2,3)18-6-4-16(5-7-18)19(17-8-9-24-20(23)14-17)15-21(26)25-10-12-27-13-11-25/h4-9,14-15H,10-13H2,1-3H3
52 atoms
Cl -1.096912 -4.167503 -0.785715
O  -4.916332 1.367772 -2.208902
O  -2.494934 2.706541 1.738983
N  -3.038605 1.510023 -0.105595
N  -2.107765 -2.961097 1.285979
C  5.720615 0.351368 -0.278429
C  4.218174 0.481634 -0.060181
C  6.032066 -1.067295 -0.7711
C  6.457167 0.60099 1.042861
C  6.242619 1.345699 -1.314198
C  -2.707622 0.835007 -1.348444
C  -4.467119 1.525145 0.16745
C  3.572238 -0.340825 0.867215
C  3.425663 1.380659 -0.770281
C  -3.531619 1.421433 -2.482212
C  -5.227892 2.073427 -1.02452
C  1.418393 0.628774 0.35195
C  -0.039577 0.703923 0.57132
C  2.204819 -0.276613 1.067339
C  2.054288 1.452823 -0.572022
C  -2.158542 2.047447 0.754216
C  -0.702374 1.864577 0.501001
C  -0.747523 -0.566677 0.845189
C  -0.567967 -1.656656 0.000581
C  -1.60869 -0.7146 1.929097
C  -1.284594 -2.807309 0.27615
C  -2.260225 -1.921297 2.101618
H  5.531604 -1.276306 -1.71847
H  5.720126 -1.827739 -0.054057
H  7.106185 -1.18532 -0.928496
H  6.156661 -0.099807 1.822612
H  6.275293 1.611538 1.412962
H  7.533762 0.488105 0.899692
H  5.787917 1.195429 -2.294893
H  7.319717 1.218852 -1.433318
H  6.067651 2.380863 -1.015556
H  -1.653721 0.955939 -1.58685
H  -2.912251 -0.235925 -1.25298
H  -4.793282 0.501409 0.378901
H  -4.678711 2.129031 1.045721
H  4.141988 -1.055597 1.448361
H  3.865637 2.036517 -1.508587
H  -3.35469 0.846597 -3.391838
H  -3.214634 2.456089 -2.668278
H  -5.010288 3.142846 -1.143922
H  -6.299205 1.965985 -0.851832
H  1.749772 -0.933213 1.798683
H  1.473684 2.146986 -1.166943
H  -0.152943 2.788768 0.357463
H  0.093321 -1.602073 -0.85311
H  -1.762337 0.085356 2.639951
H  -2.932984 -2.063639 2.937597
elementType: Cl O N C H
totalener: -1573.66648849 hartree
nucrepener: 2587.06007406 hartree
electener: -4160.72656255 hartree
oneelecener: -7289.72239992 hartree
twoeener: 3128.99583737 hartree
cpcmener: -0.04250035 hartree
kineticenergy: 1568.00993960 hartree
xcener: -130.925720752293 hartree
chargesum: -0.0000000
charge: -0.088277 -0.396168 -0.565616 -0.069988 -0.325579 0.327607 -0.092732 -0.327746 -0.330430 -0.359084 -0.081816 -0.051986 -0.182174 -0.167934 0.011306 0.021760 0.003090 0.130437 -0.209599 -0.180231 0.281429 -0.105015 0.026362 -0.221510 -0.166302 0.202699 0.026246 0.102546 0.097814 0.097363 0.097606 0.102492 0.097629 0.100457 0.100813 0.102670 0.123777 0.107237 0.100822 0.097710 0.144946 0.147376 0.104607 0.088955 0.085266 0.103105 0.156309 0.149231 0.135702 0.144442 0.148351 0.154024
qa: -0.0883 -0.3962 -0.5656 -0.0700 -0.3256 0.3276 -0.0927 -0.3277 -0.3304 -0.3591 -0.0818 -0.0520 -0.1822 -0.1679 0.0113 0.0218 0.0031 0.1304 -0.2096 -0.1802 0.2814 -0.1050 0.0264 -0.2215 -0.1663 0.2027 0.0262 0.1025 0.0978 0.0974 0.0976 0.1025 0.0976 0.1005 0.1008 0.1027 0.1238 0.1072 0.1008 0.0977 0.1449 0.1474 0.1046 0.0890 0.0853 0.1031 0.1563 0.1492 0.1357 0.1444 0.1484 0.1540
va: 1.2143 1.9196 1.9213 3.1219 3.0434 3.6424 3.7781 3.9177 3.9181 3.9272 3.8435 3.8181 3.9956 3.9249 3.9822 3.9636 3.5274 3.4026 3.9948 4.0177 4.1704 3.8312 3.5991 3.9473 3.9024 4.1550 4.0298 1.0035 1.0039 1.0033 1.0044 1.0034 1.0029 1.0009 1.0067 1.0006 1.0005 0.9984 1.0093 1.0427 1.0021 0.9991 0.9964 1.0061 1.0040 0.9968 0.9937 1.0019 1.0118 1.0135 1.0197 0.9978
dispcorr: -0.028658364 hartree
energy: -1573.695146858645
dipole: 31.67241 -30.15509 1.51732 20.27148 -19.56698 0.70450 -5.41664 4.17165 -1.24499
magnitude: 2.08533 au
magnitude: 5.30048 debye
