program: Orca
programVersion: 5.0.2
elementType: Cl O O N N C C C C C C C C C C C C C C C C C C C C C C H H H H H H H H H H H H H H H H H H H H H H H H H
charge: 0
multiplicity: 1
keywords: wb97x-d3
keywords: def2-TZVPP
keywords: def2/J RIJCOSX
keywords: DEFGRID2
keywords: scfconv7
keywords: smallprint printgap noloewdin
keywords: NOSOSCF
formula: C22H25ClN2O2
InChI: InChI=1/C22H25ClN2O2/c1-22(2,3)18-6-4-16(5-7-18)19(17-8-9-24-20(23)14-17)15-21(26)25-10-12-27-13-11-25/h4-9,14-15H,10-13H2,1-3H3
52 atoms
Cl -1.200222 -3.984574 0.885245
O  -4.845252 0.341722 1.61273
O  -2.359291 2.961484 -1.648973
N  -2.947174 1.962299 0.293725
N  -2.304824 -2.704057 -1.090659
C  5.74497 0.246658 0.240553
C  4.236348 0.388652 0.070289
C  6.427203 1.18759 -0.760484
C  6.206989 -1.188281 -0.027368
C  6.189154 0.621734 1.656533
C  -2.641845 1.351729 1.577754
C  -4.373434 2.167089 0.088439
C  3.506152 1.335517 0.790193
C  3.529052 -0.390189 -0.846498
C  -3.463396 0.090096 1.770567
C  -5.114631 0.865925 0.327946
C  1.439985 0.697306 -0.292944
C  -0.016552 0.851056 -0.484973
C  2.139868 1.486013 0.617892
C  2.161908 -0.247046 -1.02115
C  -2.052765 2.339686 -0.630243
C  -0.608191 2.04872 -0.404028
C  -0.798598 -0.381268 -0.728407
C  -0.614392 -1.489893 0.091082
C  -1.742006 -0.475723 -1.747943
C  -1.401925 -2.603145 -0.143745
C  -2.466553 -1.645613 -1.879877
H  6.14403 2.227017 -0.58463
H  6.1594 0.937774 -1.788741
H  7.513806 1.118294 -0.672341
H  5.703696 -1.901629 0.628157
H  7.279464 -1.269576 0.15746
H  6.038635 -1.501391 -1.058017
H  6.008517 1.670608 1.892977
H  7.262426 0.454221 1.760522
H  5.684817 0.014409 2.410628
H  -1.583295 1.119429 1.659646
H  -2.879217 2.067321 2.371117
H  -4.731992 2.938734 0.776368
H  -4.562765 2.511401 -0.924813
H  3.996734 1.968728 1.516745
H  4.040708 -1.132132 -1.444468
H  -3.310363 -0.290814 2.780903
H  -3.135346 -0.682281 1.064061
H  -4.840142 0.13878 -0.44892
H  -6.189066 1.040431 0.262179
H  1.61164 2.212522 1.223028
H  1.658659 -0.877477 -1.743839
H  0.000937 2.935895 -0.265741
H  0.107131 -1.478879 0.896226
H  -1.905632 0.334592 -2.444117
H  -3.204684 -1.742842 -2.665844
elementType: Cl O N C H
totalener: -1573.66623841 hartree
nucrepener: 2618.54601668 hartree
electener: -4192.21225510 hartree
oneelecener: -7352.60655372 hartree
twoeener: 3160.39429862 hartree
cpcmener: -0.04250163 hartree
kineticenergy: 1568.01383453 hartree
xcener: -130.928078857374 hartree
chargesum: -0.0000000
charge: -0.086921 -0.400088 -0.565700 -0.080083 -0.321448 0.273872 -0.041258 -0.330872 -0.335387 -0.336631 -0.095973 -0.066554 -0.196001 -0.187341 0.052218 0.014624 0.003508 0.114837 -0.192900 -0.189006 0.283105 -0.091847 0.064183 -0.239386 -0.194459 0.206335 0.028009 0.099853 0.099695 0.099157 0.108149 0.098434 0.096725 0.096682 0.098454 0.108706 0.121873 0.116490 0.111343 0.097759 0.149482 0.150315 0.113848 0.064220 0.083090 0.109166 0.149701 0.155693 0.135721 0.141856 0.149258 0.155496
qa: -0.0869 -0.4001 -0.5657 -0.0801 -0.3214 0.2739 -0.0413 -0.3309 -0.3354 -0.3366 -0.0960 -0.0666 -0.1960 -0.1873 0.0522 0.0146 0.0035 0.1148 -0.1929 -0.1890 0.2831 -0.0918 0.0642 -0.2394 -0.1945 0.2063 0.0280 0.0999 0.0997 0.0992 0.1081 0.0984 0.0967 0.0967 0.0985 0.1087 0.1219 0.1165 0.1113 0.0978 0.1495 0.1503 0.1138 0.0642 0.0831 0.1092 0.1497 0.1557 0.1357 0.1419 0.1493 0.1555
va: 1.2159 1.9231 1.9203 3.1427 3.0442 3.6927 3.7336 3.9202 3.9054 3.9059 3.8742 3.8303 3.9774 3.9564 3.9265 3.9567 3.5280 3.3839 4.0189 3.9842 4.1648 3.8253 3.5552 3.9592 3.9230 4.1374 4.0079 1.0036 1.0035 1.0024 1.0021 1.0043 1.0039 1.0034 1.0045 1.0019 1.0020 1.0088 1.0058 1.0419 0.9989 0.9981 0.9992 1.0298 1.0024 0.9991 1.0014 0.9947 1.0098 1.0148 1.0227 0.9989
dispcorr: -0.030308218 hartree
energy: -1573.696546631921
dipole: 32.46254 -30.93808 1.52446 17.34090 -16.66472 0.67619 3.59315 -2.38424 1.20891
magnitude: 2.05977 au
magnitude: 5.23553 debye
