program: Orca
programVersion: 5.0.2
elementType: Cl O O N N C C C C C C C C C C C C C C C C C C C C C C H H H H H H H H H H H H H H H H H H H H H H H H H
charge: 0
multiplicity: 1
keywords: wb97x-d3
keywords: def2-TZVPP
keywords: def2/J RIJCOSX
keywords: DEFGRID2
keywords: scfconv7
keywords: smallprint printgap noloewdin
keywords: NOSOSCF
formula: C22H25ClN2O2
InChI: InChI=1/C22H25ClN2O2/c1-22(2,3)18-6-4-16(5-7-18)19(17-8-9-24-20(23)14-17)15-21(26)25-10-12-27-13-11-25/h4-9,14-15H,10-13H2,1-3H3
52 atoms
Cl -3.387659 -3.030149 1.56523
O  -4.650177 0.76351 -1.642558
O  -2.171068 1.849938 2.392088
N  -2.77417 1.766006 0.213641
N  -1.974709 -3.002411 -0.617953
C  5.96757 0.482395 -0.50061
C  4.464103 0.528464 -0.257953
C  6.507044 1.806122 -1.038951
C  6.275755 -0.616371 -1.525556
C  6.688282 0.16576 0.815159
C  -2.484873 1.76391 -1.21102
C  -4.200803 1.806577 0.498506
C  3.802434 -0.599641 0.235493
C  3.687757 1.653628 -0.52462
C  -3.265426 0.663806 -1.906787
C  -4.900046 0.690517 -0.253599
C  1.66427 0.526475 0.175285
C  0.205285 0.524305 0.409352
C  2.434529 -0.606982 0.442841
C  2.315504 1.654007 -0.315729
C  -1.86996 1.736592 1.202188
C  -0.422653 1.6152 0.865209
C  -0.530827 -0.715487 0.077818
C  -1.485103 -1.248224 0.934926
C  -0.303446 -1.372579 -1.131196
C  -2.170041 -2.377177 0.516113
C  -1.046976 -2.496803 -1.429918
H  6.057236 2.074647 -1.996507
H  7.583537 1.725168 -1.197239
H  6.341516 2.63195 -0.344645
H  7.34954 -0.663782 -1.718704
H  5.775289 -0.421709 -2.476062
H  5.961893 -1.601828 -1.178669
H  6.496597 0.93288 1.567629
H  7.767346 0.122314 0.653473
H  6.381136 -0.794655 1.231384
H  -2.7719 2.73494 -1.626652
H  -1.421398 1.636389 -1.395647
H  -4.377262 1.693027 1.564759
H  -4.603251 2.777512 0.19454
H  4.3614 -1.499083 0.463329
H  4.141061 2.553514 -0.916695
H  -2.888806 -0.317803 -1.594988
H  -3.127748 0.749637 -2.985267
H  -5.977897 0.771045 -0.108277
H  -4.575748 -0.280533 0.146364
H  1.965775 -1.504281 0.827856
H  1.746528 2.541752 -0.563019
H  0.161434 2.48888 1.135423
H  -1.683377 -0.814814 1.90488
H  0.427805 -1.007422 -1.83905
H  -0.894747 -3.01996 -2.365235
elementType: Cl O N C H
totalener: -1573.66744872 hartree
nucrepener: 2623.29510142 hartree
electener: -4196.96255014 hartree
oneelecener: -7362.16767520 hartree
twoeener: 3165.20512507 hartree
cpcmener: -0.04312840 hartree
kineticenergy: 1568.00838520 hartree
xcener: -130.927940705710 hartree
chargesum: -0.0000000
charge: -0.090247 -0.399825 -0.565620 -0.077540 -0.318740 0.330200 -0.095590 -0.360760 -0.329336 -0.330674 -0.098285 -0.068634 -0.176374 -0.169658 0.059249 0.025733 0.007857 0.119851 -0.215280 -0.181072 0.283718 -0.095705 0.070432 -0.236330 -0.203671 0.207821 0.037289 0.101840 0.100942 0.102693 0.097579 0.102983 0.097866 0.102303 0.097457 0.098205 0.116488 0.120930 0.097276 0.112372 0.144141 0.147198 0.055006 0.114158 0.110048 0.069524 0.155189 0.149676 0.135175 0.138275 0.152711 0.151153
qa: -0.0902 -0.3998 -0.5656 -0.0775 -0.3187 0.3302 -0.0956 -0.3608 -0.3293 -0.3307 -0.0983 -0.0686 -0.1764 -0.1697 0.0592 0.0257 0.0079 0.1199 -0.2153 -0.1811 0.2837 -0.0957 0.0704 -0.2363 -0.2037 0.2078 0.0373 0.1018 0.1009 0.1027 0.0976 0.1030 0.0979 0.1023 0.0975 0.0982 0.1165 0.1209 0.0973 0.1124 0.1441 0.1472 0.0550 0.1142 0.1100 0.0695 0.1552 0.1497 0.1352 0.1383 0.1527 0.1512
va: 1.2096 1.9259 1.9208 3.1440 3.0461 3.6390 3.7769 3.9272 3.9173 3.9179 3.8787 3.8337 3.9881 3.9245 3.9197 3.9599 3.5171 3.3823 3.9970 4.0153 4.1623 3.8317 3.5377 3.9827 3.9271 4.1310 4.0054 1.0003 1.0067 1.0003 1.0033 1.0031 1.0039 1.0033 1.0033 1.0038 1.0090 1.0021 1.0424 1.0058 1.0023 0.9991 1.0321 0.9995 0.9993 1.0113 0.9954 1.0018 1.0103 1.0402 0.9991 1.0010
dispcorr: -0.030628553 hartree
energy: -1573.698077271758
dipole: 42.07398 -39.83555 2.23843 16.90067 -15.84480 1.05587 -14.04312 11.84063 -2.20249
magnitude: 3.31307 au
magnitude: 8.42115 debye
