program: Orca
programVersion: 5.0.2
elementType: Cl O O N N C C C C C C C C C C C C C C C C C C C C C C H H H H H H H H H H H H H H H H H H H H H H H H H
charge: 0
multiplicity: 1
keywords: wb97x-d3
keywords: def2-TZVPP
keywords: def2/J RIJCOSX
keywords: DEFGRID2
keywords: scfconv7
keywords: smallprint printgap noloewdin
keywords: NOSOSCF
formula: C22H25ClN2O2
InChI: InChI=1/C22H25ClN2O2/c1-22(2,3)18-6-4-16(5-7-18)19(17-8-9-24-20(23)14-17)15-21(26)25-10-12-27-13-11-25/h4-9,14-15H,10-13H2,1-3H3
52 atoms
Cl -0.254984 -4.994646 -1.21323
O  -4.738048 4.086576 1.104631
O  -2.966789 -0.463611 1.275646
N  -3.311127 1.697212 0.70347
N  -1.719865 -3.159123 -2.32584
C  5.551766 0.694692 0.335786
C  4.036928 0.529603 0.305116
C  6.050585 1.214651 1.683015
C  5.979938 1.688851 -0.750919
C  6.207863 -0.66599 0.069435
C  -2.875883 2.933237 0.078302
C  -4.740171 1.661607 0.95953
C  3.225821 0.779742 1.40939
C  3.405206 0.091093 -0.861933
C  -3.342261 4.117955 0.902742
C  -5.1392 2.896231 1.748443
C  1.227773 0.173683 0.185065
C  -0.237661 0.009647 0.118669
C  1.850991 0.604292 1.353422
C  2.035111 -0.09049 -0.923464
C  -2.527184 0.623662 0.919334
C  -1.059055 0.835699 0.778243
C  -0.76063 -1.086998 -0.728023
C  -0.289086 -2.384734 -0.57216
C  -1.712395 -0.851333 -1.716964
C  -0.818373 -3.363063 -1.397073
C  -2.157443 -1.913333 -2.481513
H  5.817116 0.532857 2.50292
H  5.632282 2.193016 1.927811
H  7.136083 1.324371 1.655057
H  5.701369 1.354186 -1.751219
H  7.064606 1.816873 -0.742244
H  5.529736 2.670693 -0.591277
H  5.917385 -1.401085 0.822554
H  7.29615 -0.576536 0.096094
H  5.936297 -1.06768 -0.90813
H  -1.793115 2.960652 -0.026317
H  -3.297654 2.990811 -0.931239
H  -5.283999 1.625163 0.009478
H  -4.997574 0.76871 1.52483
H  3.656779 1.106235 2.345825
H  3.990269 -0.118318 -1.749071
H  -3.107819 5.046981 0.38084
H  -2.810376 4.126769 1.864471
H  -4.707717 2.83869 2.757392
H  -6.224884 2.931613 1.851055
H  1.263132 0.784713 2.245002
H  1.592004 -0.426023 -1.853094
H  -0.637012 1.673255 1.323292
H  0.456714 -2.626818 0.172384
H  -2.09261 0.144524 -1.902233
H  -2.897212 -1.757667 -3.257401
elementType: Cl O N C H
totalener: -1573.67634155 hartree
nucrepener: 2528.17008964 hartree
electener: -4101.84643119 hartree
oneelecener: -7172.87347696 hartree
twoeener: 3071.02704577 hartree
cpcmener: -0.03869522 hartree
kineticenergy: 1568.00512321 hartree
xcener: -130.921334287538 hartree
chargesum: -0.0000000
charge: -0.086856 -0.377210 -0.515783 -0.064002 -0.323107 0.320866 -0.089252 -0.358340 -0.327587 -0.326209 -0.082016 -0.061838 -0.154047 -0.180358 0.024108 0.011897 -0.012654 0.238315 -0.173892 -0.206736 0.256386 -0.221152 -0.032946 -0.196013 -0.145275 0.193932 0.019559 0.100701 0.102994 0.099948 0.097026 0.096980 0.102599 0.102706 0.096843 0.097637 0.114578 0.105596 0.105107 0.098590 0.144471 0.141136 0.099900 0.082132 0.082913 0.100108 0.147837 0.155276 0.151520 0.143284 0.151670 0.148658
qa: -0.0869 -0.3772 -0.5158 -0.0640 -0.3231 0.3209 -0.0893 -0.3583 -0.3276 -0.3262 -0.0820 -0.0618 -0.1540 -0.1804 0.0241 0.0119 -0.0127 0.2383 -0.1739 -0.2067 0.2564 -0.2212 -0.0329 -0.1960 -0.1453 0.1939 0.0196 0.1007 0.1030 0.0999 0.0970 0.0970 0.1026 0.1027 0.0968 0.0976 0.1146 0.1056 0.1051 0.0986 0.1445 0.1411 0.0999 0.0821 0.0829 0.1001 0.1478 0.1553 0.1515 0.1433 0.1517 0.1487
va: 1.2157 1.9374 1.9900 3.1263 3.0475 3.6537 3.7793 3.9265 3.9181 3.9185 3.8683 3.8294 3.9163 4.0087 3.9482 3.9676 3.5756 3.3563 4.0118 3.9965 4.2259 3.7506 3.6535 3.9801 3.8981 4.1647 4.0410 1.0005 1.0004 1.0072 1.0046 1.0033 1.0032 1.0037 1.0035 1.0038 1.0052 1.0064 1.0056 1.0402 1.0000 1.0036 0.9981 1.0064 1.0035 0.9981 1.0027 0.9935 1.0021 1.0118 0.9973 0.9994
dispcorr: -0.026459114 hartree
energy: -1573.702800663764
dipole: 27.90164 -26.56880 1.33284 34.35900 -31.08744 3.27157 9.10458 -8.99676 0.10782
magnitude: 3.53430 au
magnitude: 8.98347 debye
