program: Gaussian 09
title: 000065889
version: EM64L-G09RevD.01
frameworkgroup: C1[X(C22H22ClN5O2S)]
method: RPBEPBE
basis: SDD
operation: Freq
keyword: #p
keyword: freq=noraman
keyword: PBEPBE/SDD
title: #p freq=noraman PBEPBE/SDD
converged: YES YES NO NO
title: Mulliken charges:
elementType: Cl S O O N N N N N C C C C C C C C C C C C C C C C C C C C C C H H H H H H H H H H H H H H H H H H H H H H
charge: -0.056291 0.234102 -0.242541 -0.287115 -0.149392 -0.254943 -0.016179 -0.101396 -0.136449 -0.365396 -0.375044 -0.510709 -0.512524 -0.007099 0.482263 -0.397085 0.263671 -0.301993 -0.289721 -0.421601 -0.036178 0.166295 -0.584133 0.217845 0.463187 -0.763186 -0.325199 -0.359469 -0.231794 -0.238214 -0.224662 0.228436 0.266308 0.234432 0.235016 0.255104 0.253255 0.233771 0.254133 0.227057 0.201455 0.191879 0.225424 0.282857 0.272913 0.238688 0.271562 0.245969 0.240777 0.267644 0.257886 0.237640 0.238744
chargesum: 0.00000
title: Mulliken charges with hydrogens summed into heavy atoms:
elementType: Cl S O O N N N N N C C C C C C C C C C C C C C C C C C C C C C
charge: -0.056291 0.234102 -0.242541 -0.287115 -0.149392 -0.254943 -0.016179 -0.101396 -0.136449 0.129348 0.094404 -0.002349 -0.024619 -0.007099 0.482263 -0.397085 0.263671 0.126518 0.127582 -0.138744 -0.036178 0.166295 -0.072532 0.217845 0.463187 -0.004879 -0.325199 -0.091826 0.026092 -0.000574 0.014081
polarizability: 3.60235790e+02 -2.89626064e+00 3.34676993e+02 -1.92505061e+01 -2.23873441e+01 2.29049940e+02
1716.lowfreq: -6.0405 -3.7219 -1.2552 0.0005 0.0011 0.0012 5.8799 18.4238 21.0713
frequency: 2.4448 18.3732 21.0103 31.8872 36.9316 43.8330 62.4803 69.3004 72.4931 88.5005 115.2078 134.6241 135.9670 140.8368 153.8989 164.9125 183.6530 200.7949 214.1066 222.2874 241.0763 264.5557 277.3802 280.9917 291.4238 305.9216 334.1907 341.7577 368.1440 376.3185 396.2743 405.4722 407.6482 424.7757 446.2545 462.9278 471.4906 488.0536 514.5922 533.7714 540.2253 548.4421 565.7637 586.4975 609.9531 622.2493 623.3059 632.1703 647.8411 649.9679 685.6320 709.0742 715.3547 742.6596 762.9081 772.2181 781.8085 790.0298 797.2858 825.1008 832.3708 870.5905 875.3744 895.3642 919.5385 928.3181 936.7992 940.4882 955.9743 987.6048 990.1199 995.8545 1002.1023 1006.2145 1010.8671 1017.0736 1020.2637 1029.8542 1049.8848 1050.0869 1053.3083 1067.8457 1071.8769 1107.4665 1111.7770 1123.4263 1149.2484 1173.1359 1179.5926 1181.4728 1193.4341 1207.8582 1211.3232 1243.7306 1252.2976 1254.1501 1264.7461 1274.9313 1278.5493 1286.3288 1293.8444 1321.9729 1325.2041 1333.6054 1342.8181 1353.6377 1359.1102 1366.6085 1368.0909 1384.7177 1401.3915 1415.4725 1420.6639 1443.5744 1447.3139 1448.1864 1452.6990 1453.1770 1456.2211 1458.6881 1460.0957 1463.8253 1466.9782 1485.1565 1493.7329 1525.4439 1552.3447 1568.4387 1581.0998 1586.5594 1602.0860 2941.2172 2948.0012 2960.1832 2977.0250 2978.1601 2986.1289 2990.0154 3015.1221 3032.5201 3069.4025 3076.7842 3083.6644 3084.8917 3091.9425 3093.2020 3104.4000 3118.4622 3140.5728 3154.6775 3167.6442 3174.0809 3177.7481
redmass: 6.2973 5.9730 5.8588 7.0412 6.2418 4.1666 6.1771 6.2316 5.1070 6.6133 4.7483 4.2454 2.5139 4.3905 1.4368 3.6630 2.9954 4.4240 3.6744 4.4703 7.7834 3.0455 3.2783 4.0888 3.4020 3.5985 4.3995 6.0092 7.2380 5.8063 1.9233 8.4432 6.9835 4.3481 3.0041 3.8315 4.7048 4.9199 5.0749 4.3178 4.8745 3.0339 4.3208 3.5760 6.1378 4.8834 4.6777 3.3820 5.3485 6.2593 6.1491 6.6331 5.0590 2.7753 3.2216 1.9282 4.2284 1.6001 3.8794 5.3706 1.6721 1.4273 1.4767 2.5437 8.4446 3.8867 3.1825 3.8149 1.4351 3.3632 1.3951 2.2973 2.5828 4.8337 2.3461 2.9737 5.2282 3.1188 1.5397 2.1006 2.9287 2.5921 3.6012 2.1253 2.2509 1.6676 1.3809 1.0567 1.6767 2.6265 1.0771 1.5327 1.5319 1.8090 3.3440 1.5997 1.5126 1.2202 1.5819 1.8036 2.6694 1.4412 1.2904 1.4465 1.2314 1.3410 3.1710 8.5419 1.2979 4.6324 1.2478 2.8073 2.2843 1.0908 1.0829 1.1023 1.4660 1.0860 1.1126 1.1034 2.5473 1.1151 1.1016 5.2187 3.4115 10.1430 8.3798 6.4773 7.8927 7.8051 7.0909 1.0694 1.0683 1.0681 1.0657 1.0616 1.0649 1.0381 1.0619 1.0989 1.0981 1.1016 1.0960 1.0963 1.0987 1.0938 1.0918 1.0977 1.0860 1.0905 1.0950 1.0949 1.1004
irintensity: 0.1310 1.4488 1.5628 0.8095 0.0113 1.7804 0.4986 2.2873 3.4033 0.8969 2.8671 0.2704 1.8950 1.1618 1.0304 1.7519 3.4810 1.1012 2.8371 6.3601 1.1555 2.4208 14.8728 3.2017 5.0193 2.1301 11.9844 2.2683 0.8580 2.3402 1.3649 5.7438 0.9767 4.6599 0.1045 2.8600 14.1340 2.4647 16.6601 7.3195 0.8083 5.3974 20.7458 6.7988 5.3897 4.6367 0.7232 8.4410 7.4424 4.8665 5.2798 6.2842 2.7022 27.5270 31.2500 33.7258 3.5364 7.2124 22.7667 14.0869 0.4709 8.4936 11.3718 2.8128 11.0564 2.9542 6.4861 0.2578 0.8511 4.8542 1.0339 5.7637 12.2751 9.8559 11.8792 28.8987 46.6773 17.8230 8.8101 29.6374 6.1937 2.4467 37.4851 4.5485 8.8323 0.9799 14.0387 0.8015 5.9094 2.4109 0.8520 11.9477 162.9405 1.4994 12.6584 10.3740 87.4433 8.4117 22.3228 2.5738 44.7614 24.5864 13.6036 23.5225 5.4145 1.7399 66.0245 3.6282 1.9706 159.9916 26.8394 154.5022 28.9221 7.4182 5.6532 10.0653 7.6878 21.2942 17.6164 5.4107 12.6097 15.4924 23.5809 19.5965 13.9491 101.8855 65.4092 13.8173 233.2586 86.0047 12.1525 27.7204 44.9843 51.8634 21.4075 22.2778 60.0240 11.2240 6.6591 6.5267 11.0893 8.0004 34.1793 11.1846 37.9087 15.0819 9.0236 6.6041 1.8823 9.0094 6.4503 3.0987 16.0857
temp: 298.150 k
press: 1.00000 atm
elementType: 17 16 8 8 7 7 7 7 7 6 6 6 6 6 6 6 6 6 6 6 6 6 6 6 6 6 6 6 6 6 6 1 1 1 1 1 1 1 1 1 1 1 1 1 1 1 1 1 1 1 1 1 1
symmnumber: 1
zpe: 1066799.2 jmol-1
zpe.correction: 0.406322 hartree
zpe.thermalcorrener: 0.434506 hartree
zpe.thermalcorrenthalpy: 0.435450 hartree
zpe.thermalcorrgfe: 0.342327 hartree
zpe.sumelectzpe: -2131.584100 hartree
zpe.sumelectthermal: -2131.555916 hartree
zpe.sumelectthermalent: -2131.554972 hartree
zpe.sumelectthermalfe: -2131.648095 hartree
dipole: -5.4937 4.3903 -0.0881
dipole: 7.0330
quadrupole: -229.5011 -191.3457 -199.8709
quadrupole: 32.5496 -18.5561 5.7523
quadrupole: -22.5952 15.5602 7.0350 32.5496 -18.5561 5.7523
hfenergy: -2131.9904222 hartree
pointgroup: C01 [X(C22H22Cl1N5O2S1)]
dipole: -2.3070753 -1.5235366 0.111414 debye
polarizability: 359.3473238|3.3852476|328.7317788|21.0126191|-33.6197254|235.88362 unknown
InChI: InChI=1S/C22H22ClN5O2S/c1-14-25-26-19-13-24-21(16-4-2-3-5-18(16)23)17-12-15(31-22(17)28(14)19)6-7-20(29)27-8-10-30-11-9-27/h2-5,12H,6-11,13H2,1H3
charge 0 multiplicity 1
53 atoms
Cl 1.107097 -1.695543 -1.88345
S  0.005716 2.02695 0.642535
O  -7.573982 0.896519 -1.702131
O  -4.708849 -0.104087 2.185457
N  -5.410714 0.001045 -0.027166
N  2.71234 2.105892 -0.132912
N  4.189878 -0.457708 0.883107
N  4.847291 2.807565 -0.370031
N  4.014985 3.548461 -1.26979
C  -6.816574 -0.275551 0.353786
C  -5.207227 0.163779 -1.482097
C  -2.002954 0.242446 1.695672
C  -2.978364 0.291617 0.491345
C  -0.567379 0.417423 1.285265
C  1.729722 -0.005144 0.766487
C  1.654679 1.333742 0.373496
C  -4.425889 0.04976 0.953869
C  -7.742018 0.801892 -0.238065
C  -6.181327 1.232339 -2.028543
C  0.465131 -0.497679 1.273433
C  2.952958 -0.850123 0.65361
C  4.053162 1.95791 0.297373
C  4.420942 0.948859 1.339592
C  2.745806 3.116872 -1.117888
C  2.778011 -2.307411 0.328455
C  1.572542 3.613222 -1.898843
C  1.97356 -2.816675 -0.721341
C  3.49051 -3.256482 1.113726
C  1.850854 -4.196855 -0.975682
C  3.380278 -4.641209 0.880423
C  2.55117 -5.115061 -0.162474
H  -7.109296 -1.270289 -0.038075
H  -6.869315 -0.295329 1.455095
H  -4.169056 0.458065 -1.701595
H  -5.408738 -0.801184 -1.990789
H  -2.313403 0.998942 2.43889
H  -2.108669 -0.733141 2.201972
H  -2.901657 1.275601 -0.012807
H  -2.679696 -0.468782 -0.256003
H  -8.801744 0.543771 -0.081731
H  -7.52629 1.787491 0.227442
H  -5.921967 2.227184 -1.604036
H  -6.137488 1.277528 -3.129179
H  0.334909 -1.526674 1.617878
H  5.491649 1.063809 1.563716
H  3.835556 1.146253 2.265184
H  1.952062 4.288345 -2.681376
H  1.020394 2.78512 -2.378765
H  0.85826 4.178058 -1.272396
H  4.139627 -2.868002 1.904371
H  1.230182 -4.543557 -1.806735
H  3.938225 -5.346408 1.504733
H  2.4560 -6.188768 -0.355408
